{"text_format":"1","workbook":"xlsx","n_sheets":15,"sheets":["Workbook Instructions and Notes","Targeting","Sources & Uses of Funds","Sources of Funds Summary","15-Year Op Pro Forma","15-Year Commercial Op Pro Forma","Workbook Comments","Empowerment Budget","Benchmarks","Cost Estimates by City Zip","Targeting Self-Score","Subsidy Per Unit Score","AHP Application Comparison","Data Import Summary","Version Control"],"not_rendered":{"charts":0,"images":3,"macros":1,"external_links":2,"defined_names":35,"comments":3,"pivot_tables":0},"unopened":[],"bounds":{"document_bytes":16777216,"sheet_cells":100000,"rows_first":2000,"rows_last":500,"rows_between":2000,"halvings":0,"cell_chars":16384,"cell_head_chars":4096},"cells_cut":0,"cells_raw":0,"read":"whole","date_system":"1900"}

{"sheet":"Workbook Instructions and Notes","index":0,"n_rows":66,"n_cols":2,"rows_kept":66,"cut":false,"hidden":false,"merged":[]}
[null,"Rental AHP Application Financial Workbook"]
[null,{"$f":"Targeting!A2","v":"Version 5.2 Updated 1/27/22"}]
[]
["General Instructions and Notes"]
["1.","All shaded cells are protected and cannot be altered."]
["2.","Complete all worksheets sequentially."]
["3.","Information provided in the application must be consistent across all submitted materials. Applications with submission errors, omissions, or inconsistencies that result in an incomplete analysis of the application may not be accepted, at the Bank's discretion."]
["Targeting Worksheet"]
["1.","Enter the annual 50% (very-low) AMI, adjusted for family size, based on the HUD income limit guidelines."]
["2.","Attach a copy of the relevant HUD Income Limits page showing the income data for this project."]
["3.","If applicable, indicate which units are reserved for Homeless or Special Needs. Numbers of units reserved must be consistent with the Homeless or Special Needs scoring categories to receive scoring credit. Only input the units for the category under which the project is seeking points, either Homeless or Special Needs, not both."]
["4.","For transitional housing, enter the number of projected households as the number of units."]
["5.","Under bedroom size, for studios, select “0” as the number of bedrooms. "]
["6.","Do not input operating subsidies as rental subsidies (see 15-Year Operating Pro Forma)."]
["7.","Always note non-income restricted units and manager's units."]
["8.","Enter the scheduled rent and rental subsidy for each type of unit. AHP guidelines require that the rent paid by each household (excluding utilities) not exceed 30% of the targeted income for the unit. The farthest column to the right shows if a unit passes or fails this “30% Rent Test.”"]
["9.","For occupied rental projects, households must be income-qualified to meet the AHP targeting commitments at one of two points in time:\n• Upon initial occupancy after completion of acquisition or rehab for projects with an approved relocation plan, or\n• At application for projects without an approved relocation plan.\n\nThis means that grandfathering-in households who were income-qualified at a move-in date prior to the AHP application is not allowed. For households whose incomes have increased during their tenure at the project, and now exceed the unit's original targeting designation, targeting commitments in the AHP application should reflect current household income. For example, the targeting for a unit where the household was income-qualified for a 50% AMI unit at move-in in 2015 who is now earning 80% AMI should be set at 80% AMI, not 50% AMI."]
["Sources and Uses Worksheet"]
["1.","Enter the project's total residential square footage which may include common areas and residential podium parking."]
["2.","Enter tax credit sales price, if applicable."]
["3.","Select construction type, either \"New Construction\" and/or \"Rehab.\" Also select the building type, \"Apartments,” \"Single Family Homes,” or \"Townhomes.\""]
["4.","Do not include non-cash \"costs,\" that are both a use and a source, e.g. volunteer labor, pro-bono services, or expenses to be reimbursed."]
["5.","Ensure purchase price/acquisition cost is consistent with readiness and donation sections in the AHP Application and that documentation is provided."]
["6.","If the property owner, lessee, or sponsor acquires the project property from a party, affiliated in any way with the property owner, lessee, sponsor, or any other persons or entities involved in the project, in a non-arm’s length transaction, the Bank will consider such acquisition to be a related party transaction. When evaluating related party transactions, the Bank may consider any net cash gain from the transaction as excess sources of funds, unless the gain is: 1) contributed to the project as owner equity, 2) provided to the project as carry-back financing, or 3) used to retire existing debt on the property."]
["7.","For rehabilitation of existing affordable housing projects, not involving the acquisition of property, acquisition costs (i.e., those costs reflected on the Sources and Uses Worksheet) will not be included in the total development cost for the purpose of determining the allowable developer fee. "]
["8.","Capitalized reserves (such as operating, replacement, transition, or social service reserves) must be paid for by sources other than AHP subsidy or conventional financing."]
["9.","If capitalized partnership management, asset management, and/or investor service fee reserves are included in the budget, provide an explanation and third-party documentation justifying why the capitalized fees are required. Excessive and/or unnecessary reserves may indicate that the project does not demonstrate a need for the AHP award. The Bank, at its discretion, will determine whether the reserves are acceptable and appear necessary for project feasibility."]
["10.","Include all expenses related to constructing the project's commercial space in the total commercial development costs line item in row 93, if applicable."]
["11.","Be sure to indicate all financing details, hard, soft, rates etc., of all permanent debt. The spreadsheet fully amortizes all debt. If necessary, alter worksheet columns to properly reflect simple interest or interest only payments. If financing is soft debt, loan term cells will be grayed out and details do not need to be included."]
["12.","Hard debt is defined as contractually obligated debt requiring repayment from project operating cash flow, excluding residual receipts-based loans and soft debt fee payments."]
["13.","The Annual Debt Service calculation is editable in the last column to allow for interest-only debt payments or other mandatory fee payments to be added to total debt service if needed."]
["14.","To ensure consistent and reasonable rate assumptions, interest rates and spreads should either match funding commitment documentation or be set in accordance with the Interest Rate Assumptions Guidelines for sources that are uncommitted."]
["15.","Indicate whether funds have been approved or not approved at the bottom of the worksheet."]
["16.","Documentation of approved sources of financing must be provided."]
["Sources of Funds Summary Worksheet"]
["1.","The worksheet collects data required by the Federal Housing Finance Agency. Select which sources are applicable to your project."]
["2.","Include only permanent financing sources; exclude construction and bridge financing."]
["3.","For HUD, USDA, and VA financing, select \"Other Federal Housing Programs.\""]
["4.","If a source does not fall clearly within the listed categories, select “Other.”"]
["15-Year Operating Pro Forma Worksheet"]
["1.","All costs except for the replacement reserves trend upward. All unshaded cells may be edited."]
["2.","Indicate if the project is receiving project-based rental subsidy and the status of the rental subsidy commitment, if applicable. Submit approval letter or rental subsidy agreement with Evidence of Committed Financing documentation."]
["3.","Three lines are included for \"Other\" expenses. Provide details for these \"Other\" expenses. "]
["4.","Enter residual receipts payments, any asset or partnership management fees, or deferred fees paid from cash flow on the appropriate lines. Partnership and asset management fees should be shown as residual receipts payments unless documentation is provided showing that these fees are considered by other funders to be an operating expense."]
["5.","Adjust debt service if loan payments change during the 15-year retention period."]
["6.","Social service costs cannot be included as an operating expense."]
["15-Year Commercial Operating Pro Forma Worksheet"]
["1.","Complete this worksheet if the project includes income-generating commercial space."]
["2.","If your project has permanent debt and the permanent loan has already been underwritten, indicate whether the lender included commercial income in their underwriting and sizing of the permanent loan."]
["3.","Indicate whether the commercial lease will be triple net (NNN)."]
["4.","Enter estimated commercial rents from all potential commercial tenants. If the commercial space will be master leased, enter the estimated amount of the master lease payments."]
["5.","Enter all commercial expenses in the lines provided. Three lines are included for “Other” expenses. Provide details for these “Other” expenses."]
["6.","If hard debt was used to pay for commercial development costs, include the amount of debt service that the commercial portion of the building will carry."]
["7","Total effective commercial gross income and total commercial expenses will automatically populate in the 15-year Operating Pro Forma worksheet based on what you enter in the Commercial Operating Pro Forma."]
["Promotion of Empowerment Budget Worksheet"]
["1.","This worksheet ties to the scoring of promotion of empowerment. No empowerment points will be awarded if this is not filled out."]
["2.","Include the source(s) of revenue that will be used to pay for resident services described in the promotion of empowerment section of the application."]
["3.","Include all expenses related to these services."]
["4.","Total revenue minus total expenses should equal zero."]
["Benchmarks Worksheet"]
["1.","Provide detailed explanations and supporting documentation for all benchmark deviations (e.g. requirements of other funding sources). Except for interest rate assumptions, benchmark deviations are indicated by  “No” in Column E. Deviation explanations must be quantifiable in relation to the amount the benchmark is exceeded. Supporting documentation from a third party is required for the Construction Cost per Square Foot, Capitalized Replacement Reserve, and Capitalized Operating Reserve benchmark deviations, and is preferred for all other benchmark deviations."]
["Targeting Self-Score Worksheet"]
["1.","Enter AMI target(s) other than 50% to determine the project’s Targeting score."]
["AHP Application Comparison Worksheet"]
["1.","After completing all other worksheets, press the “Run Comparison Now” button. A new window will open on your screen. Find the project’s AHP Application, select that file, and press “Open.” (Make sure macros are enabled in the workbook)."]
["2.","If there are any “No’s” in the “Match” column, review and edit the responses on the application and financial workbook to ensure consistent data between the two documents. "]

{"sheet":"Targeting","index":1,"n_rows":148,"n_cols":34,"rows_kept":148,"cut":false,"hidden":false,"merged":[[0,0,0,13],[1,0,1,13],[4,8,4,11],[14,2,18,2],[14,0,18,0],[17,6,18,6],[17,11,18,11],[9,0,12,0],[4,1,4,6],[14,1,18,1],[14,4,18,4],[5,0,5,6],[5,8,5,11]]}
["Rental Projects: Targeting"]
["Version 5.2 Updated 1/27/22"]
[]
[]
["Project Name",null,null,null,null,null,null,"MSA/ PMSA",null,null,null,null,"State"]
[null,null,null,null,null,null,null,"County",null,null,null,null,"Zip Code"]
[]
[]
[]
["2022 (if unavailable, use 2021)","Household size",null,null,"1 Person","2 Person","3 Person","4 Person","5 Person","6 person","7 Person","8 Person"]
[null,"50% AMI (HUD Very Low)"]
[null,"100% Area Median Income",null,null,{"$f":"E11*2","v":0},{"$f":"F11*2","v":0},0,0,{"$f":"I11*2","v":0},0,0,0]
[null,"Half-person",null,null,{"$f":"IF(E12=\"\",\"\",IF(E12<>0,AVERAGEA(E12:F12),0))","v":""},{"$f":"IF(F12=\"\",\"\",IF(F12<>0,AVERAGEA(F12:G12),0))","v":""},"","",{"$f":"IF(I12=\"\",\"\",IF(I12<>0,AVERAGEA(I12:J12),0))","v":""},"",""]
[]
["Number of Units ","Homeless","Special Needs",null,"Bedrooms per Unit"]
[null,null,null,"Weighted ",null," Assumed","Target","AMI","Target",0.3,"Total Rent","Rental","Rent","30% Rent"]
[null,null,null,"Average ",null,"Occupancy","AMI %","Adjusted for","Income","Rent","Received","Subsidy","Paid by","Test"]
[null,null,null,"Calculation",null,"per Unit",null,"Family Size","for Unit","Cap","for Unit",null,"Household","Pass/Fail"]
[null,null,null,null,null,"(1.5 persons/bedroom)",null,null,null,null,null,null,null,null,null,"Rent","1/2 Person","VLI Units","2nd Line","3rd Line","4th Line","5th Line","6th Line","7th Line",null,null,"Homeless","Special Needs","3+ Br Units",null,"Unit Subs","Net Rent"]
[null,null,null,{"$f":"A20*E20","v":0},null,{"$f":"IF(A20=\"\",\"\",IF(A20>0,IF(E20=0,1,(E20*1.5))))","v":""},null,{"$f":"IF(F20=1,$E$12,IF(F20=2,$F$12,IF(F20=3,$G$12,IF(F20=4,$H$12,IF(F20=5,$I$12,IF(F20=6,$J$12,IF(F20=7,$K$12,IF(F20=8,$L$12,Q20))))))))","v":0},{"$f":"IF(G20=\"\",\"\",(G20*H20))","v":""},{"$f":"IF(I20=\"\",\"\",+I20/12*0.3)","v":""},null,null,{"$f":"IF($K20=\"\",\"\",K20-L20)","v":""},{"$f":"IF(A20<>\"\",IF(K20>=0,IF((K20-L20)>J20,\"Fail\",\"Pass\")),\" \")","v":" "},null,{"$f":"+K20*A20","v":0},{"$f":"IF(F20=1.5,$E$13,IF(F20=2.5,$F$13,IF(F20=3.5,$G$13,IF(F20=4.5,$H$13,IF(F20=5.5,$I$13,IF(F20=6.5,$J$13,IF(F20=7.5,$K$13,0)))))))","v":0},{"$f":"IF(AND(G20>0,G20<=0.5),A20,0)","v":0},{"$f":"IF(G20='Targeting Self-Score'!$D$6,A20,0)","v":0},{"$f":"IF(G20='Targeting Self-Score'!$D$7,A20,0)","v":0},{"$f":"IF(G20='Targeting Self-Score'!$D$8,Targeting!A20,0)","v":0},{"$f":"IF(G20='Targeting Self-Score'!$D$9,Targeting!A20,0)","v":0},{"$f":"IF(G20='Targeting Self-Score'!$D$10,Targeting!A20,0)","v":0},{"$f":"IF(G20='Targeting Self-Score'!$D$11,Targeting!A20,0)","v":0},{"$f":"(E20*2)+1","v":1},null,{"$f":"IF($B20=\"No\",\"\",IF($B20=\"\",\"\",$A20))","v":""},{"$f":"IF($C20=\"\",0,$A20)","v":0},{"$f":"IF(E20>=3,A20,0)","v":0},null,{"$f":"(A20*L20)*12","v":0},{"$f":"M20*12*A20","v":0},null,0]
[null,null,null,0,null,{"$f":"IF(A21=\"\",\"\",IF(A21>0,IF(E21=0,1,(E21*1.5))))","v":""},null,{"$f":"IF(F21=1,$E$12,IF(F21=2,$F$12,IF(F21=3,$G$12,IF(F21=4,$H$12,IF(F21=5,$I$12,IF(F21=6,$J$12,IF(F21=7,$K$12,IF(F21=8,$L$12,Q21))))))))","v":0},{"$f":"IF(G21=\"\",\"\",(G21*H21))","v":""},{"$f":"IF(I21=\"\",\"\",+I21/12*0.3)","v":""},null,null,{"$f":"IF($K21=\"\",\"\",K21-L21)","v":""},{"$f":"IF(A21<>\"\",IF(K21>=0,IF((K21-L21)>J21,\"Fail\",\"Pass\")),\" \")","v":" "},null,0,{"$f":"IF(F21=1.5,$E$13,IF(F21=2.5,$F$13,IF(F21=3.5,$G$13,IF(F21=4.5,$H$13,IF(F21=5.5,$I$13,IF(F21=6.5,$J$13,IF(F21=7.5,$K$13,0)))))))","v":0},{"$f":"IF(AND(G21>0,G21<=0.5),A21,0)","v":0},{"$f":"IF(G21='Targeting Self-Score'!$D$6,A21,0)","v":0},{"$f":"IF(G21='Targeting Self-Score'!$D$7,A21,0)","v":0},{"$f":"IF(G21='Targeting Self-Score'!$D$8,Targeting!A21,0)","v":0},{"$f":"IF(G21='Targeting Self-Score'!$D$9,Targeting!A21,0)","v":0},{"$f":"IF(G21='Targeting Self-Score'!$D$10,Targeting!A21,0)","v":0},{"$f":"IF(G21='Targeting Self-Score'!$D$11,Targeting!A21,0)","v":0},1,null,{"$f":"IF($B21=\"No\",\"\",IF($B21=\"\",\"\",$A21))","v":""},{"$f":"IF($C21=\"\",0,$A21)","v":0},0,null,{"$f":"(A21*L21)*12","v":0},0,null,1]
[null,null,null,0,null,"",null,{"$f":"IF(F22=1,$E$12,IF(F22=2,$F$12,IF(F22=3,$G$12,IF(F22=4,$H$12,IF(F22=5,$I$12,IF(F22=6,$J$12,IF(F22=7,$K$12,IF(F22=8,$L$12,Q22))))))))","v":0},"","",null,null,{"$f":"IF($K22=\"\",\"\",K22-L22)","v":""}," ",null,0,0,0,{"$f":"IF(G22='Targeting Self-Score'!$D$6,A22,0)","v":0},{"$f":"IF(G22='Targeting Self-Score'!$D$7,A22,0)","v":0},{"$f":"IF(G22='Targeting Self-Score'!$D$8,Targeting!A22,0)","v":0},{"$f":"IF(G22='Targeting Self-Score'!$D$9,Targeting!A22,0)","v":0},{"$f":"IF(G22='Targeting Self-Score'!$D$10,Targeting!A22,0)","v":0},{"$f":"IF(G22='Targeting Self-Score'!$D$11,Targeting!A22,0)","v":0},1,null,"",0,0,null,0,0,null,2]
[null,null,null,0,null,"",null,0,"","",null,null,""," ",null,0,0,0,{"$f":"IF(G23='Targeting Self-Score'!$D$6,A23,0)","v":0},{"$f":"IF(G23='Targeting Self-Score'!$D$7,A23,0)","v":0},{"$f":"IF(G23='Targeting Self-Score'!$D$8,Targeting!A23,0)","v":0},{"$f":"IF(G23='Targeting Self-Score'!$D$9,Targeting!A23,0)","v":0},{"$f":"IF(G23='Targeting Self-Score'!$D$10,Targeting!A23,0)","v":0},{"$f":"IF(G23='Targeting Self-Score'!$D$11,Targeting!A23,0)","v":0},1,null,"",0,0,null,0,0,null,3]
[null,null,null,{"$f":"A24*E24","v":0},null,"",null,0,"","",null,null,""," ",null,0,0,0,{"$f":"IF(G24='Targeting Self-Score'!$D$6,A24,0)","v":0},{"$f":"IF(G24='Targeting Self-Score'!$D$7,A24,0)","v":0},{"$f":"IF(G24='Targeting Self-Score'!$D$8,Targeting!A24,0)","v":0},{"$f":"IF(G24='Targeting Self-Score'!$D$9,Targeting!A24,0)","v":0},{"$f":"IF(G24='Targeting Self-Score'!$D$10,Targeting!A24,0)","v":0},{"$f":"IF(G24='Targeting Self-Score'!$D$11,Targeting!A24,0)","v":0},1,null,"",0,0,null,0,0,null,4]
[null,null,null,0,null,"",null,0,"","",null,null,""," ",null,0,0,0,{"$f":"IF(G25='Targeting Self-Score'!$D$6,A25,0)","v":0},{"$f":"IF(G25='Targeting Self-Score'!$D$7,A25,0)","v":0},{"$f":"IF(G25='Targeting Self-Score'!$D$8,Targeting!A25,0)","v":0},{"$f":"IF(G25='Targeting Self-Score'!$D$9,Targeting!A25,0)","v":0},{"$f":"IF(G25='Targeting Self-Score'!$D$10,Targeting!A25,0)","v":0},{"$f":"IF(G25='Targeting Self-Score'!$D$11,Targeting!A25,0)","v":0},1,null,"",0,0,null,0,0,null,5]
[null,null,null,0,null,"",null,0,"","",null,null,""," ",null,0,0,0,{"$f":"IF(G26='Targeting Self-Score'!$D$6,A26,0)","v":0},{"$f":"IF(G26='Targeting Self-Score'!$D$7,A26,0)","v":0},{"$f":"IF(G26='Targeting Self-Score'!$D$8,Targeting!A26,0)","v":0},{"$f":"IF(G26='Targeting Self-Score'!$D$9,Targeting!A26,0)","v":0},{"$f":"IF(G26='Targeting Self-Score'!$D$10,Targeting!A26,0)","v":0},{"$f":"IF(G26='Targeting Self-Score'!$D$11,Targeting!A26,0)","v":0},1,null,"",0,0,null,0,0]
[null,null,null,0,null,"",null,0,"","",null,null,""," ",null,0,0,0,{"$f":"IF(G27='Targeting Self-Score'!$D$6,A27,0)","v":0},{"$f":"IF(G27='Targeting Self-Score'!$D$7,A27,0)","v":0},{"$f":"IF(G27='Targeting Self-Score'!$D$8,Targeting!A27,0)","v":0},{"$f":"IF(G27='Targeting Self-Score'!$D$9,Targeting!A27,0)","v":0},{"$f":"IF(G27='Targeting Self-Score'!$D$10,Targeting!A27,0)","v":0},{"$f":"IF(G27='Targeting Self-Score'!$D$11,Targeting!A27,0)","v":0},1,null,"",0,0,null,0,0]
[null,null,null,0,null,"",null,0,"","",null,null,""," ",null,0,0,0,{"$f":"IF(G28='Targeting Self-Score'!$D$6,A28,0)","v":0},{"$f":"IF(G28='Targeting Self-Score'!$D$7,A28,0)","v":0},{"$f":"IF(G28='Targeting Self-Score'!$D$8,Targeting!A28,0)","v":0},{"$f":"IF(G28='Targeting Self-Score'!$D$9,Targeting!A28,0)","v":0},{"$f":"IF(G28='Targeting Self-Score'!$D$10,Targeting!A28,0)","v":0},{"$f":"IF(G28='Targeting Self-Score'!$D$11,Targeting!A28,0)","v":0},1,null,"",0,0,null,0,0]
[null,null,null,0,null,"",null,0,{"$f":"IF(G29=\"\",\"\",(G29*H29))","v":""},{"$f":"IF(I29=\"\",\"\",+I29/12*0.3)","v":""},null,null,""," ",null,0,0,0,{"$f":"IF(G29='Targeting Self-Score'!$D$6,A29,0)","v":0},{"$f":"IF(G29='Targeting Self-Score'!$D$7,A29,0)","v":0},{"$f":"IF(G29='Targeting Self-Score'!$D$8,Targeting!A29,0)","v":0},{"$f":"IF(G29='Targeting Self-Score'!$D$9,Targeting!A29,0)","v":0},{"$f":"IF(G29='Targeting Self-Score'!$D$10,Targeting!A29,0)","v":0},{"$f":"IF(G29='Targeting Self-Score'!$D$11,Targeting!A29,0)","v":0},1,null,"",0,0,null,0,0]
[null,null,null,0,null,"",null,0,"","",null,null,""," ",null,0,0,0,{"$f":"IF(G30='Targeting Self-Score'!$D$6,A30,0)","v":0},{"$f":"IF(G30='Targeting Self-Score'!$D$7,A30,0)","v":0},{"$f":"IF(G30='Targeting Self-Score'!$D$8,Targeting!A30,0)","v":0},{"$f":"IF(G30='Targeting Self-Score'!$D$9,Targeting!A30,0)","v":0},{"$f":"IF(G30='Targeting Self-Score'!$D$10,Targeting!A30,0)","v":0},{"$f":"IF(G30='Targeting Self-Score'!$D$11,Targeting!A30,0)","v":0},1,null,"",0,0,null,0,0]
[null,null,null,0,null,"",null,0,"","",null,null,""," ",null,0,0,0,{"$f":"IF(G31='Targeting Self-Score'!$D$6,A31,0)","v":0},{"$f":"IF(G31='Targeting Self-Score'!$D$7,A31,0)","v":0},{"$f":"IF(G31='Targeting Self-Score'!$D$8,Targeting!A31,0)","v":0},{"$f":"IF(G31='Targeting Self-Score'!$D$9,Targeting!A31,0)","v":0},{"$f":"IF(G31='Targeting Self-Score'!$D$10,Targeting!A31,0)","v":0},{"$f":"IF(G31='Targeting Self-Score'!$D$11,Targeting!A31,0)","v":0},1,null,"",0,0,null,0,0]
[null,null,null,0,null,"",null,0,"","",null,null,""," ",null,0,0,0,{"$f":"IF(G32='Targeting Self-Score'!$D$6,A32,0)","v":0},{"$f":"IF(G32='Targeting Self-Score'!$D$7,A32,0)","v":0},{"$f":"IF(G32='Targeting Self-Score'!$D$8,Targeting!A32,0)","v":0},{"$f":"IF(G32='Targeting Self-Score'!$D$9,Targeting!A32,0)","v":0},{"$f":"IF(G32='Targeting Self-Score'!$D$10,Targeting!A32,0)","v":0},{"$f":"IF(G32='Targeting Self-Score'!$D$11,Targeting!A32,0)","v":0},1,null,"",0,0,null,0,0]
[null,null,null,0,null,"",null,0,"","",null,null,""," ",null,0,0,0,{"$f":"IF(G33='Targeting Self-Score'!$D$6,A33,0)","v":0},{"$f":"IF(G33='Targeting Self-Score'!$D$7,A33,0)","v":0},{"$f":"IF(G33='Targeting Self-Score'!$D$8,Targeting!A33,0)","v":0},{"$f":"IF(G33='Targeting Self-Score'!$D$9,Targeting!A33,0)","v":0},{"$f":"IF(G33='Targeting Self-Score'!$D$10,Targeting!A33,0)","v":0},{"$f":"IF(G33='Targeting Self-Score'!$D$11,Targeting!A33,0)","v":0},1,null,"",0,0,null,0,0]
[null,null,null,0,null,"",null,0,"","",null,null,""," ",null,0,0,0,{"$f":"IF(G34='Targeting Self-Score'!$D$6,A34,0)","v":0},{"$f":"IF(G34='Targeting Self-Score'!$D$7,A34,0)","v":0},{"$f":"IF(G34='Targeting Self-Score'!$D$8,Targeting!A34,0)","v":0},{"$f":"IF(G34='Targeting Self-Score'!$D$9,Targeting!A34,0)","v":0},{"$f":"IF(G34='Targeting Self-Score'!$D$10,Targeting!A34,0)","v":0},{"$f":"IF(G34='Targeting Self-Score'!$D$11,Targeting!A34,0)","v":0},1,null,"",0,0,null,0,0]
[null,null,null,0,null,"",null,0,"","",null,null,""," ",null,0,0,0,{"$f":"IF(G35='Targeting Self-Score'!$D$6,A35,0)","v":0},{"$f":"IF(G35='Targeting Self-Score'!$D$7,A35,0)","v":0},{"$f":"IF(G35='Targeting Self-Score'!$D$8,Targeting!A35,0)","v":0},{"$f":"IF(G35='Targeting Self-Score'!$D$9,Targeting!A35,0)","v":0},{"$f":"IF(G35='Targeting Self-Score'!$D$10,Targeting!A35,0)","v":0},{"$f":"IF(G35='Targeting Self-Score'!$D$11,Targeting!A35,0)","v":0},1,null,"",0,0,null,0,0]
[null,null,null,0,null,"",null,0,"","",null,null,""," ",null,0,0,0,{"$f":"IF(G36='Targeting Self-Score'!$D$6,A36,0)","v":0},{"$f":"IF(G36='Targeting Self-Score'!$D$7,A36,0)","v":0},{"$f":"IF(G36='Targeting Self-Score'!$D$8,Targeting!A36,0)","v":0},{"$f":"IF(G36='Targeting Self-Score'!$D$9,Targeting!A36,0)","v":0},{"$f":"IF(G36='Targeting Self-Score'!$D$10,Targeting!A36,0)","v":0},{"$f":"IF(G36='Targeting Self-Score'!$D$11,Targeting!A36,0)","v":0},1,null,"",0,0,null,0,0]
[null,null,null,0,null,"",null,0,"","",null,null,""," ",null,0,0,{"$f":"IF(AND(G37>0,G37<=0.5),A37,0)","v":0},{"$f":"IF(G37='Targeting Self-Score'!$D$6,A37,0)","v":0},{"$f":"IF(G37='Targeting Self-Score'!$D$7,A37,0)","v":0},{"$f":"IF(G37='Targeting Self-Score'!$D$8,Targeting!A37,0)","v":0},{"$f":"IF(G37='Targeting Self-Score'!$D$9,Targeting!A37,0)","v":0},{"$f":"IF(G37='Targeting Self-Score'!$D$10,Targeting!A37,0)","v":0},{"$f":"IF(G37='Targeting Self-Score'!$D$11,Targeting!A37,0)","v":0},{"$f":"(E37*2)+1","v":1},null,"",{"$f":"IF($C37=\"\",0,$A37)","v":0},{"$f":"IF(E37>=3,A37,0)","v":0},null,{"$f":"(A37*L37)*12","v":0},{"$f":"M37*12*A37","v":0}]
[null,null,null,0,null,"",null,0,"","",null,null,""," ",null,0,0,{"$f":"IF(AND(G38>0,G38<=0.5),A38,0)","v":0},{"$f":"IF(G38='Targeting Self-Score'!$D$6,A38,0)","v":0},{"$f":"IF(G38='Targeting Self-Score'!$D$7,A38,0)","v":0},{"$f":"IF(G38='Targeting Self-Score'!$D$8,Targeting!A38,0)","v":0},{"$f":"IF(G38='Targeting Self-Score'!$D$9,Targeting!A38,0)","v":0},{"$f":"IF(G38='Targeting Self-Score'!$D$10,Targeting!A38,0)","v":0},{"$f":"IF(G38='Targeting Self-Score'!$D$11,Targeting!A38,0)","v":0},{"$f":"(E38*2)+1","v":1},null,"",0,{"$f":"IF(E38>=3,A38,0)","v":0},null,{"$f":"(A38*L38)*12","v":0},{"$f":"M38*12*A38","v":0}]
[null,null,null,0,null,"",null,0,"","",null,null,""," ",null,0,0,{"$f":"IF(AND(G39>0,G39<=0.5),A39,0)","v":0},{"$f":"IF(G39='Targeting Self-Score'!$D$6,A39,0)","v":0},{"$f":"IF(G39='Targeting Self-Score'!$D$7,A39,0)","v":0},{"$f":"IF(G39='Targeting Self-Score'!$D$8,Targeting!A39,0)","v":0},{"$f":"IF(G39='Targeting Self-Score'!$D$9,Targeting!A39,0)","v":0},{"$f":"IF(G39='Targeting Self-Score'!$D$10,Targeting!A39,0)","v":0},{"$f":"IF(G39='Targeting Self-Score'!$D$11,Targeting!A39,0)","v":0},{"$f":"(E39*2)+1","v":1},null,"",0,{"$f":"IF(E39>=3,A39,0)","v":0},null,{"$f":"(A39*L39)*12","v":0},{"$f":"M39*12*A39","v":0}]
[null,null,null,{"$f":"A40*E40","v":0},null,"",null,0,"","",null,null,""," ",null,0,0,{"$f":"IF(AND(G40>0,G40<=0.5),A40,0)","v":0},{"$f":"IF(G40='Targeting Self-Score'!$D$6,A40,0)","v":0},{"$f":"IF(G40='Targeting Self-Score'!$D$7,A40,0)","v":0},{"$f":"IF(G40='Targeting Self-Score'!$D$8,Targeting!A40,0)","v":0},{"$f":"IF(G40='Targeting Self-Score'!$D$9,Targeting!A40,0)","v":0},{"$f":"IF(G40='Targeting Self-Score'!$D$10,Targeting!A40,0)","v":0},{"$f":"IF(G40='Targeting Self-Score'!$D$11,Targeting!A40,0)","v":0},{"$f":"(E40*2)+1","v":1},null,"",{"$f":"IF($C40=\"\",0,$A40)","v":0},{"$f":"IF(E40>=3,A40,0)","v":0},null,{"$f":"(A40*L40)*12","v":0},{"$f":"M40*12*A40","v":0}]
[{"$f":"IF(SUM(A20:A40)=\"\",\"\",SUM(A20:A40))","v":""},"Income-restricted units",null,null,null,null,null,null,null,null,{"$f":"IF(P41=\"\",\"\",+P41*12)","v":""},{"$f":"IF(AE41=0,\"\",AE41)","v":""},{"$f":"IF(AF41=0,\"\",AF41)","v":""},null,null,{"$f":"SUM(P20:P40)","v":0},null,{"$f":"SUM(R20:R40)","v":0},0,0,0,0,0,0,null,null,null,null,{"$f":"SUM(AC20:AC40)","v":0},null,{"$f":"SUM(AE20:AE40)","v":0},{"$f":"SUM(AF20:AF40)","v":0}]
[0,"Income-restricted manager units (included above)"]
[0,"Non income-restricted manager unit(s)"]
[0,"Non income-restricted special needs unit(s)"]
[0,"Non income-restricted units with 3+ bedrooms"]
[0,"Other non income-restricted unit(s)"]
[{"$f":"IF((+A41+A43+A46+A44+A45)=0,\"\",+A41+A43+A46+A44+A45)","v":""},"Total units in project (non-income restricted and restricted)"]
[{"$f":"IF(A41=\"\",\"\",IF(A41>0,R41/A47,0))","v":""},"Percentage of units targeted to 50% AMI or below (must be at least 20%)"]
[{"$f":"IF(SUM(AA$20:AA$42)=0,\"\",SUM(AA$20:AA$42))","v":""},"Homeless units"]
[{"$f":"IF(SUM(AB$20:AB$42)+A44=0,\"\",SUM(AB$20:AB$42)+A44)","v":""},"Special needs units"]
[{"$f":"IF(A47=\"\",\"\",SUM(D20:D40)/A41)","v":""},"Average bedrooms per unit"]
[{"$f":"IF(A41=\"\",\"\",SUMPRODUCT(G20:G40,A20:A40)/SUM(A20:A40))","v":""},"Weighted Average Target AMI %"]
[{"$f":"(SUMIF(E20:E40,\">=3\",A20:A40))+A45","v":0},"Units with 3+ bedrooms"]
[]
[]
[]
[]
[null,null,null,null,null,null,null,"Yes","Seniors","Alameda"]
[null,null,null,null,null,null,null,"No","Other","Alpine"]
[null,null,null,null,null,null,null,null,null,"Amador"]
[null,null,null,null,null,null,null,null,null,"Butte"]
[null,null,null,null,null,null,null,null,null,"Calaveras"]
[null,null,null,null,null,null,null,null,null,"Colusa"]
[null,null,null,null,null,null,null,null,null,"Contra Costa"]
[null,null,null,null,null,null,null,null,null,"Del Norte"]
[null,null,null,null,null,null,null,null,null,"El Dorado"]
[null,null,null,null,null,null,null,null,null,"Fresno"]
[null,null,null,null,null,null,null,null,null,"Glenn"]
[null,null,null,null,null,null,null,null,null,"Humboldt"]
[null,null,null,null,null,null,null,null,null,"Imperial"]
[null,null,null,null,null,null,null,null,null,"Inyo"]
[null,null,null,null,null,null,null,null,null,"Kern"]
[null,null,null,null,null,null,null,null,null,"Kings"]
[null,null,null,null,null,null,null,null,null,"Lake"]
[null,null,null,null,null,null,null,null,null,"Lassen"]
[null,null,null,null,null,null,null,null,null,"Los Angeles"]
[null,null,null,null,null,null,null,null,null,"Madera"]
[null,null,null,null,null,null,null,null,null,"Marin"]
[null,null,null,null,null,null,null,null,null,"Mariposa"]
[null,null,null,null,null,null,null,null,null,"Mendocino"]
[null,null,null,null,null,null,null,null,null,"Merced"]
[null,null,null,null,null,null,null,null,null,"Modoc"]
[null,null,null,null,null,null,null,null,null,"Mono"]
[null,null,null,null,null,null,null,null,null,"Monterey"]
[null,null,null,null,null,null,null,null,null,"Napa"]
[null,null,null,null,null,null,null,null,null,"Nevada"]
[null,null,null,null,null,null,null,null,null,"Orange"]
[null,null,null,null,null,null,null,null,null,"Placer"]
[null,null,null,null,null,null,null,null,null,"Plumas"]
[null,null,null,null,null,null,null,null,null,"Riverside"]
[null,null,null,null,null,null,null,null,null,"Sacramento"]
[null,null,null,null,null,null,null,null,null,"San Benito"]
[null,null,null,null,null,null,null,null,null,"San Bernardino"]
[null,null,null,null,null,null,null,null,null,"San Diego"]
[null,null,null,null,null,null,null,null,null,"San Francisco"]
[null,null,null,null,null,null,null,null,null,"San Joaquin"]
[null,null,null,null,null,null,null,null,null,"San Luis Obispo"]
[null,null,null,null,null,null,null,null,null,"San Mateo"]
[null,null,null,null,null,null,null,null,null,"Santa Barbara"]
[null,null,null,null,null,null,null,null,null,"Santa Clara"]
[null,null,null,null,null,null,null,null,null,"Santa Cruz"]
[null,null,null,null,null,null,null,null,null,"Shasta"]
[null,null,null,null,null,null,null,null,null,"Sierra"]
[null,null,null,null,null,null,null,null,null,"Siskiyou"]
[null,null,null,null,null,null,null,null,null,"Solano"]
[null,null,null,null,null,null,null,null,null,"Sonoma"]
[null,null,null,null,null,null,null,null,null,"Stanislaus"]
[null,null,null,null,null,null,null,null,null,"Sutter"]
[null,null,null,null,null,null,null,null,null,"Tehama"]
[null,null,null,null,null,null,null,null,null,"Trinity"]
[null,null,null,null,null,null,null,null,null,"Tulare"]
[null,null,null,null,null,null,null,null,null,"Tuolumne"]
[null,null,null,null,null,null,null,null,null,"Ventura"]
[null,null,null,null,null,null,null,null,null,"Yolo"]
[null,null,null,null,null,null,null,null,null,"Yuba"]
[null,null,null,null,null,null,null,null,null,"Apache"]
[null,null,null,null,null,null,null,null,null,"Cochise"]
[null,null,null,null,null,null,null,null,null,"Coconino"]
[null,null,null,null,null,null,null,null,null,"Gila"]
[null,null,null,null,null,null,null,null,null,"Graham"]
[null,null,null,null,null,null,null,null,null,"Greenlee"]
[null,null,null,null,null,null,null,null,null,"La Paz"]
[null,null,null,null,null,null,null,null,null,"Maricopa"]
[null,null,null,null,null,null,null,null,null,"Mohave"]
[null,null,null,null,null,null,null,null,null,"Navajo"]
[null,null,null,null,null,null,null,null,null,"Pima"]
[null,null,null,null,null,null,null,null,null,"Pinal"]
[null,null,null,null,null,null,null,null,null,"Santa Cruz"]
[null,null,null,null,null,null,null,null,null,"Yavapai"]
[null,null,null,null,null,null,null,null,null,"Yuma"]
[null,null,null,null,null,null,null,null,null,"Carson City"]
[null,null,null,null,null,null,null,null,null,"Churchill"]
[null,null,null,null,null,null,null,null,null,"Clark"]
[null,null,null,null,null,null,null,null,null,"Douglas"]
[null,null,null,null,null,null,null,null,null,"Elko"]
[null,null,null,null,null,null,null,null,null,"Esmeralda"]
[null,null,null,null,null,null,null,null,null,"Eureka"]
[null,null,null,null,null,null,null,null,null,"Humboldt"]
[null,null,null,null,null,null,null,null,null,"Lander"]
[null,null,null,null,null,null,null,null,null,"Lincoln"]
[null,null,null,null,null,null,null,null,null,"Lyon"]
[null,null,null,null,null,null,null,null,null,"Mineral"]
[null,null,null,null,null,null,null,null,null,"Nye"]
[null,null,null,null,null,null,null,null,null,"Pershing"]
[null,null,null,null,null,null,null,null,null,"Storey"]
[null,null,null,null,null,null,null,null,null,"Washoe"]
[null,null,null,null,null,null,null,null,null,"White Pine"]
[null,null,null,null,null,null,null,null,null,"Out of District"]

{"sheet":"Sources & Uses of Funds","index":2,"n_rows":109,"n_cols":20,"rows_kept":109,"cut":false,"hidden":false,"merged":[[88,0,88,1],[3,0,3,1],[20,0,20,2],[28,0,28,2],[21,0,21,2],[6,15,7,15],[108,9,108,13],[13,0,13,2],[6,4,7,4],[11,0,11,2],[18,0,18,2],[16,0,16,2],[17,0,17,2],[9,0,9,2],[92,0,92,2],[97,2,97,3],[96,5,96,6],[94,3,94,4],[65,0,65,2],[66,0,66,2],[91,0,91,2],[93,0,93,2],[89,0,89,2],[63,0,63,2],[6,14,7,14],[6,13,7,13],[6,6,7,6],[3,12,3,13],[6,12,7,12],[6,7,7,7],[5,7,5,14],[6,3,7,3],[6,5,7,5],[6,11,7,11],[5,4,5,6],[6,8,7,8],[3,5,3,6],[3,8,3,10],[6,9,7,9],[6,10,7,10],[3,2,3,4],[0,0,0,14],[1,0,1,14],[8,0,8,2],[15,0,15,2],[38,0,38,2],[44,0,44,2],[45,0,45,2],[43,0,43,2],[35,0,35,2],[30,0,30,2],[40,0,40,2],[42,0,42,2],[19,0,19,2],[23,0,23,2],[22,0,22,2],[29,0,29,2],[27,0,27,2],[36,0,36,2],[41,0,41,1],[26,0,26,2],[25,0,25,2],[14,0,14,2],[12,0,12,2],[10,0,10,2],[77,0,77,2],[62,0,62,2],[87,0,87,2],[73,0,73,2],[79,0,79,1],[86,0,86,2],[64,0,64,2],[75,0,75,2],[68,0,68,2],[80,0,80,2],[81,0,81,2],[84,0,84,2],[85,0,85,2],[82,0,82,2],[83,0,83,2],[69,0,69,2],[67,0,67,2],[70,0,70,2],[71,0,71,2],[76,0,76,2],[78,0,78,2],[72,0,72,1],[74,0,74,2],[61,0,61,2],[60,0,60,2],[31,0,31,2],[32,0,32,2],[33,0,33,2],[48,0,48,2],[50,0,50,2],[51,0,51,1],[49,0,49,2],[46,0,46,2],[39,0,39,2],[37,0,37,2],[34,0,34,2],[55,0,55,2],[56,0,56,2],[57,0,57,1],[59,0,59,2],[52,0,52,2],[53,0,53,2],[47,0,47,1],[58,0,58,2],[54,0,54,2]]}
["Rental Projects: Sources & Uses of Funds"]
[{"$f":"Targeting!A2:M2","v":"Version 5.2 Updated 1/27/22"}]
[]
["Project Name",null,{"$f":"IF(+Targeting!B5=\"\",\"\",+Targeting!B5)","v":""},null,null,"Total Units",null,{"$f":"Targeting!A47","v":""},"Residential Square Footage",null,null,null,"Tax Credit Sales Price"]
[]
[null,null,"Select From Below",null,null,null,null,"Sources of Financing (Enter additional sources below)"]
["Construction Type",null,null,"Uses of Funds","AHP Requested","Owner Equity","LIHTC Proceeds","Permanent Loan",null,null,null,null,null,null,"(Must = 0)","Pct of Total Expenses"]
["Building Type",null,null,null,null,null,null,null,null,null,null,null,null,null,null,null,null,null,"Column1","Column2"]
["LAND COST/ACQUISITION",null,null,null,null,null,null,null,null,null,null,null,null,null,null,null,null,null,"New","Apartments"]
["Land Cost",null,null,null,null,null,null,null,null,null,null,null,null,null,{"$f":"+D10-SUM(E10:N10)","v":0},{"$f":"IF(OR($D$92=\"\",D10=\"\",D10=0),\"\",D10/$D$92)","v":""},null,null,"Rehab","Single Family Homes"]
["Holding Costs",null,null,null,null,null,null,null,null,null,null,null,null,null,0,{"$f":"IF(OR($D$92=\"\",D11=\"\",D11=0),\"\",D11/$D$92)","v":""},null,null,null,"Townhomes"]
["Demolition",null,null,null,null,null,null,null,null,null,null,null,null,null,0,""]
["Legal (includes closing costs)",null,null,null,null,null,null,null,null,null,null,null,null,null,0,""]
["Total Land Cost",null,null,{"$f":"SUM(D10:D13)","v":0},{"$f":"SUM(E10:E13)","v":0},0,0,0,0,0,0,0,0,0,0,""]
["Existing Improvements",null,null,null,null,null,null,null,null,null,null,null,null,null,0,""]
["Off-Site Improvements",null,null,null,null,null,null,null,null,null,null,null,null,null,0,""]
["  Total Land & Acquisition Costs",null,null,{"$f":"SUM(D14:D16)","v":0},{"$f":"SUM(E14:E16)","v":0},{"$f":"SUM(F14:F16)","v":0},{"$f":"SUM(G14:G16)","v":0},0,0,0,0,0,0,0,0,""]
["NEW CONSTRUCTION / REHAB",null,null,null,null,null,null,null,null,null,null,null,null,null,null,""]
["Site Work",null,null,null,null,null,null,null,null,null,null,null,null,null,{"$f":"+D19-SUM(E19:N19)","v":0},""]
["Structures",null,null,null,null,null,null,null,null,null,null,null,null,null,{"$f":"+D20-SUM(E20:N20)","v":0},""]
["General Requirements",null,null,null,null,null,null,null,null,null,null,null,null,null,0,""]
["Contractor Overhead",null,null,null,null,null,null,null,null,null,null,null,null,null,0,""]
["Contractor Profit",null,null,null,null,null,null,null,null,null,null,null,null,null,0,""]
["Prevailing Wages",null,null,null,null,null,null,null,null,null,null,null,null,null,0,""]
["General Liabilities Insurance ",null,null,null,null,null,null,null,null,null,null,null,null,null,0,""]
["Environmental Remediation",null,null,null,null,null,null,null,null,null,null,null,null,null,0,""]
["Hard Cost Contingency",null,null,null,null,null,null,null,null,null,null,null,null,null,0,""]
["Total New Construction / Rehab Costs",null,null,{"$f":"SUM(D19:D27)","v":0},{"$f":"SUM(E19:E27)","v":0},{"$f":"SUM(F19:F27)","v":0},0,0,0,{"$f":"SUM(J19:J27)","v":0},0,0,0,0,0,""]
["ARCHITECTURAL FEES",null,null,null,null,null,null,null,null,null,null,null,null,null,null,""]
["Design",null,null,null,null,null,null,null,null,null,null,null,null,null,{"$f":"+D30-SUM(E30:N30)","v":0},""]
["Supervision",null,null,null,null,null,null,null,null,null,null,null,null,null,{"$f":"+D31-SUM(E31:N31)","v":0},""]
["Survey & Engineering",null,null,null,null,null,null,null,null,null,null,null,null,null,{"$f":"+D32-SUM(E32:N32)","v":0},""]
["Total Architectural & Engineering Costs",null,null,{"$f":"SUM(D30:D32)","v":0},{"$f":"SUM(E30:E32)","v":0},{"$f":"SUM(F30:F32)","v":0},{"$f":"SUM(G30:G32)","v":0},0,0,0,0,0,0,0,{"$f":"+D33-SUM(E33:N33)","v":0},""]
["CONSTRUCTION INTEREST & FEES",null,null,null,null,null,null,null,null,null,null,null,null,null,null,""]
["Construction Loan Interest",null,null,null,null,null,null,null,null,null,null,null,null,null,{"$f":"+D35-SUM(E35:N35)","v":0},""]
["Origination Fee",null,null,null,null,null,null,null,null,null,null,null,null,null,0,""]
["Credit Enchancement & Application Fee",null,null,null,null,null,null,null,null,null,null,null,null,null,0,""]
["Bond Premium",null,null,null,null,null,null,null,null,null,null,null,null,null,0,""]
["Taxes",null,null,null,null,null,null,null,null,null,null,null,null,null,0,""]
["Insurance",null,null,null,null,null,null,null,null,null,null,null,null,null,0,""]
["Title & Recording",null,null,null,null,null,null,null,null,null,null,null,null,null,0,""]
["Other",null,null,null,null,null,null,null,null,null,null,null,null,null,0,""]
["Total Construction Interest & Fees",null,null,{"$f":"SUM(D35:D42)","v":0},{"$f":"SUM(E35:E42)","v":0},{"$f":"SUM(F35:F42)","v":0},{"$f":"SUM(G35:G42)","v":0},0,0,0,0,0,0,0,0,""]
["PERMANENT FINANCING",null,null,null,null,null,null,null,null,null,null,null,null,null,null,""]
["Loan Origination Fee",null,null,null,null,null,null,null,null,null,null,null,null,null,{"$f":"+D45-SUM(E45:N45)","v":0},""]
["Credit Enhancement & Application Fee",null,null,null,null,null,null,null,null,null,null,null,null,null,{"$f":"+D46-SUM(E46:N46)","v":0},""]
["Title & Recording",null,null,null,null,null,null,null,null,null,null,null,null,null,{"$f":"+D47-SUM(E47:N47)","v":0},""]
["Other",null,null,null,null,null,null,null,null,null,null,null,null,null,{"$f":"+D48-SUM(E48:N48)","v":0},""]
["Total Permanent Financing Costs",null,null,{"$f":"SUM(D45:D48)","v":0},{"$f":"SUM(E45:E48)","v":0},{"$f":"SUM(F45:F48)","v":0},{"$f":"SUM(G45:G48)","v":0},0,0,0,0,0,0,0,{"$f":"+D49-SUM(E49:N49)","v":0},""]
["LEGAL FEES",null,null,null,null,null,null,null,null,null,null,null,null,null,null,""]
["Lender Legal Paid by Applicant",null,null,null,null,null,null,null,null,null,null,null,null,null,{"$f":"+D51-SUM(E51:N51)","v":0},""]
["Other",null,null,null,null,null,null,null,null,null,null,null,null,null,{"$f":"+D52-SUM(E52:N52)","v":0},""]
["Total Attorney Costs",null,null,{"$f":"SUM(D51:D52)","v":0},{"$f":"SUM(E51:E52)","v":0},{"$f":"SUM(F51:F52)","v":0},{"$f":"SUM(G51:G52)","v":0},0,0,0,0,0,0,0,{"$f":"+D53-SUM(E53:N53)","v":0},""]
["RESERVES",null,null,null,null,null,null,null,null,null,null,null,null,null,null,""]
["Rent Reserves",null,null,null,null,null,null,null,null,null,null,null,null,null,{"$f":"+D55-SUM(E55:N55)","v":0},""]
["Operating Reserves",null,null,null,null,null,null,null,null,null,null,null,null,null,{"$f":"+D56-SUM(E56:N56)","v":0},""]
["Replacement Reserves",null,null,null,null,null,null,null,null,null,null,null,null,null,{"$f":"+D57-SUM(E57:N57)","v":0},""]
["Other",null,null,null,null,null,null,null,null,null,null,null,null,null,{"$f":"+D58-SUM(E58:N58)","v":0},""]
["  Total Reserve Costs",null,null,{"$f":"SUM(D55:D58)","v":0},{"$f":"SUM(E55:E58)","v":0},{"$f":"SUM(F55:F58)","v":0},{"$f":"SUM(G55:G58)","v":0},0,0,0,0,0,0,0,{"$f":"+D59-SUM(E59:N59)","v":0},""]
["OTHER PROJECT COSTS",null,null,null,null,null,null,null,null,null,null,null,null,null,null,""]
["TCAC Application/Allocation/Monitoring Fees",null,null,null,null,null,null,null,null,null,null,null,null,null,{"$f":"+D61-SUM(E61:N61)","v":0},""]
["Environmental Audit",null,null,null,null,null,null,null,null,null,null,null,null,null,0,""]
["Local Development Impact Fees",null,null,null,null,null,null,null,null,null,null,null,null,null,0,""]
["Permit Processing Fees",null,null,null,null,null,null,null,null,null,null,null,null,null,0,""]
["Capital Fees",null,null,null,null,null,null,null,null,null,null,null,null,null,0,""]
["Marketing",null,null,null,null,null,null,null,null,null,null,null,null,null,0,""]
["Furnishings",null,null,null,null,null,null,null,null,null,null,null,null,null,0,""]
["OTHER PROJECT COSTS (continued)",null,null,null,null,null,null,null,null,null,null,null,null,null,null,""]
["Appraisal",null,null,null,null,null,null,null,null,null,null,null,null,null,{"$f":"+D69-SUM(E69:N69)","v":0},""]
["Market Study",null,null,null,null,null,null,null,null,null,null,null,null,null,0,""]
["Relocation Expenses",null,null,null,null,null,null,null,null,null,null,null,null,null,0,""]
["Soft Cost Contingency",null,null,null,null,null,null,null,null,null,null,null,null,null,0,""]
["Other",null,null,null,null,null,null,null,null,null,null,null,null,null,0,""]
["Total Other Costs",null,null,{"$f":"SUM(D61:D73)","v":0},{"$f":"SUM(E61:E73)","v":0},{"$f":"SUM(F61:F73)","v":0},{"$f":"SUM(G61:G73)","v":0},0,0,0,0,0,0,0,0,""]
["DEVELOPER COSTS",null,null,null,null,null,null,null,null,null,null,null,null,null,null,{"$f":"IF(OR($D$92=\"\",D75=\"\",D75=0),\"\",D75/$D$92)","v":""}]
["Developer Fee (includes Project Administration)",null,null,null,null,null,null,null,null,null,null,null,null,null,{"$f":"D76-SUM(E76:N76)","v":0},""]
["Consultant/Processing Agent",null,null,null,null,null,null,null,null,null,null,null,null,null,0,""]
["Broker Fees Paid with Project Funds to a Related Party",null,null,null,null,null,null,null,null,null,null,null,null,null,0,""]
["Construction Management Oversight",null,null,null,null,null,null,null,null,null,null,null,null,null,0,""]
["Other",null,null,null,null,null,null,null,null,null,null,null,null,null,0,""]
["Total Developer Costs",null,null,{"$f":"SUM(D76:D80)","v":0},{"$f":"SUM(E76:E80)","v":0},{"$f":"SUM(F76:F80)","v":0},{"$f":"SUM(G76:G80)","v":0},0,0,0,0,0,0,0,0,""]
["SYNDICATION (Investor & General Partner)",null,null,null,null,null,null,null,null,null,null,null,null,null,null,""]
["Organizational Fee",null,null,null,null,null,null,null,null,null,null,null,null,null,{"$f":"D83-SUM(E83:N83)","v":0},""]
["Bridge Loan Fees/Expenses",null,null,null,null,null,null,null,null,null,null,null,null,null,0,""]
["Legal Fees",null,null,null,null,null,null,null,null,null,null,null,null,null,0,""]
["Consultant Fees",null,null,null,null,null,null,null,null,null,null,null,null,null,0,""]
["Accountant Fees",null,null,null,null,null,null,null,null,null,null,null,null,null,0,""]
["Tax Opinion",null,null,null,null,null,null,null,null,null,null,null,null,null,0,""]
["Other",null,null,null,null,null,null,null,null,null,null,null,null,null,0,""]
["Total Syndication Costs",null,null,{"$f":"SUM(D83:D89)","v":0},{"$f":"SUM(E83:E89)","v":0},{"$f":"SUM(F83:F89)","v":0},{"$f":"SUM(G83:G89)","v":0},0,0,0,0,0,0,0,{"$f":"+D90-SUM(E90:N90)","v":0},""]
[null,null,null,null,null,null,null,null,null,null,null,null,null,null,null,null,null,null,"Loan"]
["  Total Residential Development Costs",null,null,{"$f":"+D17+D28+D33+D43+D49+D53+D59+D74+D81+D90","v":0},{"$f":"+E17+E28+E33+E43+E49+E53+E59+E74+E81+E90","v":0},0,0,0,0,0,0,0,0,0,{"$f":"+D92-SUM(E92:N92)","v":0},{"$f":"IF(OR($D$92=\"\",$D$92=0),\"\",D92/$D$92)","v":""},null,null,"Grant"]
["  Total Commercial Development Costs",null,null,null,null,null,null,null,null,null,null,null,null,null,{"$f":"+D93-SUM(E93:N93)","v":0},null,null,null,"Equity"]
["  Grand Totals Sources and Uses",null,null,{"$f":"D92+D93","v":0},{"$f":"E92+E93","v":0},0,0,0,0,0,0,0,0,0,{"$f":"+D94-SUM(E94:N94)","v":0}]
[null,null,null,"Loan, grant, or equity?",null,"Equity","Equity","Loan"]
[null,null,"Status of Permanent Financing Commitment (Approved or Not Approved)"]
[null,null,null,null,null,"If loan, soft or hard debt? "]
[null,null,"If hard debt, complete all required cells",null,null,null,null,null,null,null,null,null,null,null,null,null,null,null,"Soft"]
[null,null,null,null,null,null,"Loan Term (years)",null,null,null,null,null,null,null,null,null,null,null,"Hard"]
[null,null,null,null,null,null,"Loan Amortization Period (years)"]
[null,null,null,null,null,null,"Loan Interest Rate"]
[null,null,null,null,null,null,"Annual Debt Service (year 1) (calculate for hard debt only)",{"$f":"IF(H101>0,ABS(PMT(H101/12,H100*12,H94)*12),0)","v":0},{"$f":"IF(I101>0,ABS(PMT(I101/12,I100*12,I94)*12),0)","v":0},0,0,{"$f":"IF(L101>0,ABS(PMT(L101/12,L100*12,L94)*12),0)","v":0},{"$f":"IF(M101>0,ABS(PMT(M101/12,M100*12,M94)*12),0)","v":0},{"$f":"IF(N101>0,ABS(PMT(N101/12,N100*12,N94)*12),0)","v":0},{"$f":"SUM(H102:N102)","v":0}]
[null,null,null,null,null,null,"Loan Adjustment Period(s)"]
[null,null,null,null,null,null,"Loan Adjustment Caps (basis points)",null,null,null,null,null,null,null,null,null,null,null,"Not Approved"]
[null,null,null,null,null,null,"Balloon Payments (term year)",null,null,null,null,null,null,null,null,null,null,null,"Approved"]
[null,null,null,null,null,null,"Special Terms?"]
[]
[]
[null,null,null,null,null,null,null,null,null,"Total Committed Financing",null,null,null,null,{"$f":"F94+IF(G96=\"Approved\",G94,0)+IF(H96=\"Approved\",H94,0)+IF(I96=\"Approved\",I94,0)+IF(J96=\"Approved\",J94,0)+IF(K96=\"Approved\",K94,0)+IF(L96=\"Approved\",L94,0)+IF(M96=\"Approved\",M94,0)+IF(N96=\"Approved\",N94,0)","v":0}]

{"sheet":"Sources of Funds Summary","index":3,"n_rows":23,"n_cols":13,"rows_kept":23,"cut":false,"hidden":false,"merged":[[14,1,14,3],[20,1,20,3],[16,1,16,3],[17,1,17,3],[18,1,18,3],[19,1,19,3],[15,1,15,3],[0,0,0,3],[1,0,1,3],[13,1,13,3],[7,0,7,3],[4,1,4,3],[5,0,6,3],[8,1,9,3],[8,0,9,0],[10,1,10,3],[11,1,11,3],[12,1,12,3]]}
["Rental Projects: Sources of Funds Summary"]
[{"$f":"Targeting!A2","v":"Version 5.2 Updated 1/27/22"}]
[]
[]
["Project Name",{"$f":"IF(Targeting!B5:G5=\"\",\"\",Targeting!B5:G5)","v":""},null,null,null,null,null,null,null,null,null,null,"Response"]
["Please provide the required information below.",null,null,null,null,null,null,null,null,null,null,null,"Yes"]
[null,null,null,null,null,null,null,null,null,null,null,null,"No"]
["Project Financing Sources* "]
["Select                 \"Yes\" or \"No\"","Does the project intend to utilize funding from the following:"]
[]
[null,"HOME"]
[null,"Community Development Block Grant (CDBG)"]
[null,"Federal Housing Administration (FHA) insured"]
[null,"Low Income Housing Tax Credits (LIHTC)"]
[null,"Other Federal Housing Programs (excluding those listed above)"]
[null,"Tax-exempt Multifamily Housing Bonds (excluding construction sources)"]
[null,"State Funds (excluding Federal Government program funds)"]
[null,"Local Government Funds (excluding Federal Government program funds)"]
[null,"Non-Government Donated Funds (charitable funds)"]
[null,"Member Permanent Loans "]
[null,"Other (including Owner Equity, Deferred Fee, Sponsor Loans, etc.)"]
[]
["* List only permanent financing sources. "]

{"sheet":"15-Year Op Pro Forma","index":4,"n_rows":47,"n_cols":30,"rows_kept":47,"cut":false,"hidden":false,"merged":[[3,15,3,17],[3,18,3,19],[46,0,46,4],[37,0,37,4],[38,0,38,4],[39,0,39,4],[40,0,40,4],[44,0,44,2],[44,3,44,4],[43,0,43,2],[42,3,42,4],[43,3,43,4],[41,0,41,2],[45,0,45,2],[45,3,45,4],[42,0,42,2],[41,3,41,4],[26,0,26,4],[29,0,29,4],[36,0,36,2],[34,2,34,4],[30,0,30,4],[31,0,31,4],[33,2,33,4],[35,2,35,4],[33,0,33,1],[34,0,34,1],[32,0,32,4],[21,0,21,4],[12,0,12,1],[13,0,13,1],[11,0,11,4],[12,2,12,4],[19,0,19,4],[18,0,18,4],[20,0,20,4],[23,0,23,4],[22,0,22,4],[28,0,28,2],[27,0,27,2],[24,0,24,4],[25,0,25,4],[0,0,0,19],[1,0,1,19],[3,8,3,13],[17,0,17,2],[16,0,16,2],[6,0,6,4],[7,0,7,4],[3,5,3,6],[13,2,13,4],[10,0,10,4],[5,0,5,2],[8,0,8,4],[9,0,9,2],[3,3,3,4],[14,0,14,4],[3,0,3,2]]}
["Rental Projects: 15-Year Operating Pro Forma"]
[{"$f":"'Sources & Uses of Funds'!A2","v":"Version 5.2 Updated 1/27/22"}]
[]
["Project Name",null,null,{"$f":"IF(+Targeting!B5=\"\",\"\",+Targeting!B5)","v":""},null,"Total Units",null,{"$f":"Targeting!A47","v":""},"Project Based Rental Subsidy (Indicate \"Yes\" or \"No\")",null,null,null,null,null,null,"If Yes, what is the status?"]
[null,null,null,null,null,null,null,null,null,null,null,null,null,null,null,null,null,null,null,null,null,null,null,null,null,null,null,null,null,"Column1"]
["Income Assumptions",null,null,"Rate of Increase",null,"Year 1","Year 2","Year 3","Year 4","Year 5","Year 6","Year 7","Year 8","Year 9","Year 10","Year 11","Year 12","Year 13","Year 14","Year 15","Year 1 Pct of Total Expenses",null,null,null,null,null,null,null,null,"Yes"]
["Gross Residential Rents-Restricted Income Units",null,null,null,null,{"$f":"IF(+Targeting!M41=\"\",0,+Targeting!M41)","v":0},{"$f":"(F7*$E$6)+F7","v":0},{"$f":"(G7*$E$6)+G7","v":0},0,0,0,0,0,0,0,0,0,0,0,0,null,null,null,null,null,null,null,null,null,"No"]
["Gross Residential Rents-Restricted Income Units Subsidy",null,null,null,null,{"$f":"IF(+Targeting!L41=\"\",0,+Targeting!L41)","v":0},{"$f":"(F8*$E$6)+F8","v":0},{"$f":"(G8*$E$6)+G8","v":0},0,0,0,0,0,0,0,0,0,0,0,0]
["Gross Residential Rents-Non-restricted Income Units",null,null,null,null,0,{"$f":"(F9*$E$6)+F9","v":0},0,0,0,0,0,0,0,0,0,0,0,0,0,null,null,null,null,null,null,null,null,null,"Status of Project Based Rental Subsidy Commitment"]
["   Less Vacancy ",null,null,"% of Gross Rents =",null,{"$f":"((F7+F8+F9)*$E$10)*-1","v":0},{"$f":"((G7+G8+G9)*$E$10)*-1","v":0},0,0,0,0,0,0,0,0,0,0,0,0,0,null,null,null,null,null,null,null,null,null,"Approved"]
["Commercial Income",null,null,null,null,{"$f":"'15-Year Commercial Op Pro Forma'!F11","v":0},{"$f":"'15-Year Commercial Op Pro Forma'!G11","v":0},{"$f":"'15-Year Commercial Op Pro Forma'!H11","v":0},{"$f":"'15-Year Commercial Op Pro Forma'!I11","v":0},{"$f":"'15-Year Commercial Op Pro Forma'!J11","v":0},{"$f":"'15-Year Commercial Op Pro Forma'!K11","v":0},{"$f":"'15-Year Commercial Op Pro Forma'!L11","v":0},{"$f":"'15-Year Commercial Op Pro Forma'!M11","v":0},{"$f":"'15-Year Commercial Op Pro Forma'!N11","v":0},{"$f":"'15-Year Commercial Op Pro Forma'!O11","v":0},{"$f":"'15-Year Commercial Op Pro Forma'!P11","v":0},{"$f":"'15-Year Commercial Op Pro Forma'!Q11","v":0},{"$f":"'15-Year Commercial Op Pro Forma'!R11","v":0},{"$f":"'15-Year Commercial Op Pro Forma'!S11","v":0},{"$f":"'15-Year Commercial Op Pro Forma'!T11","v":0},null,null,null,null,null,null,null,null,null,"Not Approved"]
["Laundry, Parking",null,null,null,null,null,{"$f":"(F12*$E$6)+F12","v":0},0,0,0,0,0,0,0,0,0,0,0,0,0]
["Other",null,null,null,null,null,{"$f":"(F13*$E$6)+F13","v":0},0,0,0,0,0,0,0,0,0,0,0,0,0]
["Other",null,null,null,null,null,{"$f":"(F14*$E$6)+F14","v":0},{"$f":"(G14*$E$6)+G14","v":0},0,0,0,0,0,0,0,0,0,0,0,0]
["Total Effective Gross Income",null,null,null,null,{"$f":"SUM(F7:F14)","v":0},0,0,0,0,0,0,0,0,0,0,0,0,0,0]
[]
["Expense Assumptions",null,null,"Rate of Increase"]
["Management Fee",null,null,"Dollars per Unit/Mo. =",{"$f":"IF(F18=\"\",\"\",(F18/$H$4)/12)","v":""},null,{"$f":"(F18*$E$17)+F18","v":0},{"$f":"(G18*$E$17)+G18","v":0},0,0,0,0,0,0,0,0,0,0,0,0,{"$f":"IF(OR($F$37=\"\",F18=0),\"\",F18/$F$37)","v":""}]
["Legal & Audit",null,null,null,null,null,{"$f":"(F19*$E$17)+F19","v":0},0,0,0,0,0,0,0,0,0,0,0,0,0,""]
["Advertising",null,null,null,null,null,0,0,0,0,0,0,0,0,0,0,0,0,0,0,""]
["Gas & Electric",null,null,null,null,null,0,0,0,0,0,0,0,0,0,0,0,0,0,0,""]
["Water, Sewer, Waste Removal",null,null,null,null,null,0,0,0,0,0,0,0,0,0,0,0,0,0,0,""]
["Supplies",null,null,null,null,null,0,0,0,0,0,0,0,0,0,0,0,0,0,0,""]
["Payroll",null,null,null,null,null,0,0,0,0,0,0,0,0,0,0,0,0,0,0,""]
["Insurance",null,null,null,null,null,0,0,0,0,0,0,0,0,0,0,0,0,0,0,""]
["Pest Control",null,null,null,null,null,0,0,0,0,0,0,0,0,0,0,0,0,0,0,""]
["Maintenance / Repair",null,null,null,null,null,0,0,0,0,0,0,0,0,0,0,0,0,0,0,""]
["Operating Reserves",null,null,"Dollars per Unit =",{"$f":"IF(F28=\"\",\"\",(F28/$H$4))","v":""},null,0,0,0,0,0,0,0,0,0,0,0,0,0,0,""]
["Replacement Reserves",null,null,"Dollars per Unit =",{"$f":"IF(F29=\"\",\"\",+F29/H4)","v":""},null,{"$f":"F29","v":0},{"$f":"G29","v":0},0,0,0,0,0,0,0,0,0,0,0,0,""]
["Real Estate Taxes (exempt if in CA)",null,null,null,null,null,0,0,0,0,0,0,0,0,0,0,0,0,0,0,""]
["Local & State Assessments",null,null,null,null,null,0,0,0,0,0,0,0,0,0,0,0,0,0,0,""]
["Mandatory Debt Fee Payments (e.g., CA MHP, TOD, MHSA)",null,null,null,null,null,{"$f":"(F32)","v":0},{"$f":"(G32)","v":0},0,0,0,0,0,0,0,0,0,0,0,0,""]
["Commercial Expenses",null,null,null,null,{"$f":"IF('15-Year Commercial Op Pro Forma'!$T$4=\"Yes\",\"0\",'15-Year Commercial Op Pro Forma'!F31)","v":0},{"$f":"IF('15-Year Commercial Op Pro Forma'!$T$4=\"Yes\",\"0\",'15-Year Commercial Op Pro Forma'!G31)","v":0},{"$f":"IF('15-Year Commercial Op Pro Forma'!$T$4=\"Yes\",\"0\",'15-Year Commercial Op Pro Forma'!H31)","v":0},{"$f":"IF('15-Year Commercial Op Pro Forma'!$T$4=\"Yes\",\"0\",'15-Year Commercial Op Pro Forma'!I31)","v":0},{"$f":"IF('15-Year Commercial Op Pro Forma'!$T$4=\"Yes\",\"0\",'15-Year Commercial Op Pro Forma'!J31)","v":0},{"$f":"IF('15-Year Commercial Op Pro Forma'!$T$4=\"Yes\",\"0\",'15-Year Commercial Op Pro Forma'!K31)","v":0},{"$f":"IF('15-Year Commercial Op Pro Forma'!$T$4=\"Yes\",\"0\",'15-Year Commercial Op Pro Forma'!L31)","v":0},{"$f":"IF('15-Year Commercial Op Pro Forma'!$T$4=\"Yes\",\"0\",'15-Year Commercial Op Pro Forma'!M31)","v":0},{"$f":"IF('15-Year Commercial Op Pro Forma'!$T$4=\"Yes\",\"0\",'15-Year Commercial Op Pro Forma'!N31)","v":0},{"$f":"IF('15-Year Commercial Op Pro Forma'!$T$4=\"Yes\",\"0\",'15-Year Commercial Op Pro Forma'!O31)","v":0},{"$f":"IF('15-Year Commercial Op Pro Forma'!$T$4=\"Yes\",\"0\",'15-Year Commercial Op Pro Forma'!P31)","v":0},{"$f":"IF('15-Year Commercial Op Pro Forma'!$T$4=\"Yes\",\"0\",'15-Year Commercial Op Pro Forma'!Q31)","v":0},{"$f":"IF('15-Year Commercial Op Pro Forma'!$T$4=\"Yes\",\"0\",'15-Year Commercial Op Pro Forma'!R31)","v":0},{"$f":"IF('15-Year Commercial Op Pro Forma'!$T$4=\"Yes\",\"0\",'15-Year Commercial Op Pro Forma'!S31)","v":0},{"$f":"IF('15-Year Commercial Op Pro Forma'!$T$4=\"Yes\",\"0\",'15-Year Commercial Op Pro Forma'!T31)","v":0},""]
["Other",null,null,null,null,null,{"$f":"(F34*$E$17)+F34","v":0},0,0,0,0,0,0,0,0,0,0,0,0,0,""]
["Other",null,null,null,null,null,{"$f":"(F35*$E$17)+F35","v":0},0,0,0,0,0,0,0,0,0,0,0,0,0,""]
["Other",null,null,null,null,null,{"$f":"(F36*$E$17)+F36","v":0},0,0,0,0,0,0,0,0,0,0,0,0,0,""]
["Total Expenses",null,null,"Operating Cost/Unit",{"$f":"IF(F37=0,\"\",+F37/H4)","v":""},{"$f":"SUM(F18:F36)","v":0},0,0,0,0,0,0,0,0,0,0,0,0,0,0,""]
["Net Operating Income",null,null,null,null,{"$f":"+F15-F37","v":0},0,0,0,0,0,0,0,0,0,0,0,0,0,0]
["Debt Service (Hard Debt Only from S&U Statement)",null,null,null,null,{"$f":"+'Sources & Uses of Funds'!O102","v":0},{"$f":"+F39","v":0},{"$f":"+G39","v":0},0,0,0,0,0,0,0,0,0,0,0,0]
["Debt Service Coverage Ratio",null,null,null,null,{"$f":"IF(F39>0,(F38/F39),0)","v":0},{"$f":"IF(G39>0,(G38/G39),0)","v":0},0,0,0,0,0,0,0,0,0,0,0,0,0]
["Cash Flow",null,null,null,null,{"$f":"+F38-F39","v":0},{"$f":"+G38-G39","v":0},0,0,0,0,0,0,0,0,0,0,0,0,0]
["Operating Grant/Reserve"]
["Operating Grant/Reserve"]
["Residual Receipts Payment to",null,null,"Asset and/or Partnership Mgmt. Fee"]
["Residual Receipts Payment to"]
["Residual Receipts Payment to"]
["Net Cash Flow",null,null,null,null,{"$f":"+F41+F42+F43-F44-F45-F46","v":0},{"$f":"+G41+G42+G43-G44-G45-G46","v":0},0,0,0,0,0,0,0,0,0,0,0,0,0]

{"sheet":"15-Year Commercial Op Pro Forma","index":5,"n_rows":41,"n_cols":24,"rows_kept":41,"cut":false,"hidden":false,"merged":[[39,0,39,2],[39,3,39,4],[40,0,40,4],[36,0,36,2],[36,3,36,4],[37,0,37,2],[37,3,37,4],[38,0,38,2],[38,3,38,4],[31,0,31,4],[32,0,32,4],[33,0,33,4],[34,0,34,4],[35,0,35,2],[35,3,35,4],[30,0,30,2],[23,0,23,2],[24,0,24,2],[25,0,25,4],[26,0,26,4],[27,0,27,1],[27,2,27,4],[28,0,28,1],[28,2,28,4],[29,2,29,4],[22,0,22,4],[10,0,10,4],[12,0,12,2],[13,0,13,2],[14,0,14,4],[15,0,15,4],[16,0,16,4],[17,0,17,4],[18,0,18,4],[19,0,19,4],[20,0,20,4],[21,0,21,4],[7,0,7,2],[8,0,8,1],[8,2,8,4],[9,0,9,1],[9,2,9,4],[5,0,5,2],[6,0,6,4],[0,0,0,19],[1,0,1,19],[3,0,3,2],[3,3,3,4],[3,5,3,6],[3,8,3,15],[3,17,3,18]]}
["Rental Projects: 15-Year Commercial Operating Pro Forma"]
[{"$f":"'Sources & Uses of Funds'!A2","v":"Version 5.2 Updated 1/27/22"}]
[]
["Project Name",null,null,{"$f":"IF(+Targeting!B5=\"\",\"\",+Targeting!B5)","v":""},null,"Total Units",null,{"$f":"Targeting!A47","v":""},"Did your permanent lender include commercial income in their underwriting?",null,null,null,null,null,null,null,null,"Triple Net Lease?"]
[]
["Income Assumptions",null,null,"Rate of Increase",null,"Year 1","Year 2","Year 3","Year 4","Year 5","Year 6","Year 7","Year 8","Year 9","Year 10","Year 11","Year 12","Year 13","Year 14","Year 15","Pct of Year 1 Total Expenses"]
["Scheduled Commercial Rents",null,null,null,null,null,{"$f":"(F7*$E$6)+F7","v":0},{"$f":"(G7*$E$6)+G7","v":0},{"$f":"(H7*$E$6)+H7","v":0},0,0,0,0,0,0,0,0,0,0,0,null,null,null,"Yes"]
["   Less Vacancy ",null,null,"% of Gross Rents =",null,{"$f":"(F7*$E$8)*-1","v":0},{"$f":"(G7*$E$8)*-1","v":0},{"$f":"(H7*$E$8)*-1","v":0},0,0,0,0,0,0,0,0,0,0,0,0,null,null,null,"No"]
["Other",null,null,null,null,null,{"$f":"(F9*$E$6)+F9","v":0},{"$f":"(G9*$E$6)+G9","v":0},0,0,0,0,0,0,0,0,0,0,0,0,null,null,null,"N/A"]
["Other",null,null,null,null,null,{"$f":"(F10*$E$6)+F10","v":0},0,0,0,0,0,0,0,0,0,0,0,0,0]
["Total Effective Commercial Gross Income",null,null,null,null,{"$f":"SUM(F7:F10)","v":0},{"$f":"SUM(G7:G10)","v":0},0,0,0,0,0,0,0,0,0,0,0,0,0]
[]
["Expense Assumptions",null,null,"Rate of Increase"]
["Management Fee",null,null,"Dollars per Unit/Mo. =",{"$f":"IF(F14=\"\",\"\",(F14/$H$4)/12)","v":""},null,{"$f":"F14*(1+$E$13)","v":0},{"$f":"G14*(1+$E$13)","v":0},0,0,{"$f":"J14*(1+$E$13)","v":0},0,0,0,0,0,0,0,0,0,{"$f":"IF(OR($F$31=\"\",F14=0),\"\",F14/$F$31)","v":""}]
["Legal & Audit",null,null,null,null,null,{"$f":"(F15*$E$13)+F15","v":0},0,0,0,0,0,0,0,0,0,0,0,0,0,{"$f":"IF(OR($F$31=\"\",F15=0),\"\",F15/$F$31)","v":""}]
["Advertising",null,null,null,null,null,0,0,0,0,0,0,0,0,0,0,0,0,0,0,""]
["Gas & Electric",null,null,null,null,null,0,0,0,0,0,0,0,0,0,0,0,0,0,0,""]
["Water, Sewer, Waste Removal",null,null,null,null,null,0,0,0,0,0,0,0,0,0,0,0,0,0,0,""]
["Supplies",null,null,null,null,null,0,0,0,0,0,0,0,0,0,0,0,0,0,0,""]
["Payroll",null,null,null,null,null,0,0,0,0,0,0,0,0,0,0,0,0,0,0,""]
["Insurance",null,null,null,null,null,0,0,0,0,0,0,0,0,0,0,0,0,0,0,""]
["Pest Control",null,null,null,null,null,0,0,0,0,0,0,0,0,0,0,0,0,0,0,""]
["Maintenance / Repair",null,null,null,null,null,0,0,0,0,0,0,0,0,0,0,0,0,0,0,""]
["Operating Reserves",null,null,"Dollars per Unit =",{"$f":"IF(F24=\"\",\"\",(F24/$H$4))","v":""},null,0,0,0,0,0,0,0,0,0,0,0,0,0,0,""]
["Replacement Reserves",null,null,"Dollars per Unit =",{"$f":"IF(F25=\"\",\"\",+F25/H4)","v":""},null,{"$f":"F25","v":0},{"$f":"G25","v":0},0,0,0,0,0,0,0,0,0,0,0,0,""]
["Real Estate Taxes",null,null,null,null,null,0,0,0,0,0,0,0,0,0,0,0,0,0,0,""]
["Local & State Assessments",null,null,null,null,null,0,0,0,0,0,0,0,0,0,0,0,0,0,0,""]
["Other",null,null,null,null,null,{"$f":"(F28*$E$13)+F28","v":0},0,0,0,0,0,0,0,0,0,0,0,0,0,""]
["Other",null,null,null,null,null,0,0,0,0,0,0,0,0,0,0,0,0,0,0,""]
["Other",null,null,null,null,null,0,0,0,0,0,0,0,0,0,0,0,0,0,0,""]
["Total Expenses",null,null,"Operating Cost/Unit",{"$f":"IF(F31=0,\"\",+F31/H4)","v":""},{"$f":"SUM(F14:F30)","v":0},{"$f":"SUM(G14:G30)","v":0},0,0,0,0,0,0,0,0,0,0,0,0,0,""]
["Net Operating Income",null,null,null,null,{"$f":"+F11-F31","v":0},{"$f":"+G11-G31","v":0},0,0,0,0,0,0,0,0,0,0,0,0,0]
["Debt Service (Hard Debt Only)",null,null,null,null,null,{"$f":"+F33","v":0},{"$f":"+G33","v":0},0,0,0,0,0,0,0,0,0,0,0,0]
["Debt Service Coverage Ratio",null,null,null,null,{"$f":"IF(F33>0,(F32/F33),0)","v":0},{"$f":"IF(G33>0,(G32/G33),0)","v":0},0,0,0,0,0,0,0,0,0,0,0,0,0]
["Cash Flow",null,null,null,null,{"$f":"+F32-F33","v":0},{"$f":"+G32-G33","v":0},0,0,0,0,0,0,0,0,0,0,0,0,0]
["Operating Grant/Reserve"]
["Operating Grant/Reserve"]
["Residual Receipts Payment to"]
["Residual Receipts Payment to"]
["Residual Receipts Payment to"]
["Net Cash Flow",null,null,null,null,{"$f":"+F35+F36+F37-F38-F39-F40","v":0},{"$f":"+G35+G36+G37-G38-G39-G40","v":0},0,0,0,0,0,0,0,0,0,0,0,0,0]

{"sheet":"Workbook Comments","index":6,"n_rows":26,"n_cols":7,"rows_kept":26,"cut":false,"hidden":false,"merged":[[26,0,32,6],[0,0,0,7],[1,0,1,7],[3,0,3,2],[3,4,3,5],[7,0,7,6],[8,0,14,6],[16,0,16,6],[17,0,23,6],[25,0,25,6],[5,0,5,6]]}
["Rental Projects: Workbook Comments"]
[{"$f":"'Sources & Uses of Funds'!A2","v":"Version 5.2 Updated 1/27/22"}]
[]
["Project Name",null,null,{"$f":"IF(+Targeting!B5=\"\",\"\",+Targeting!B5)","v":""},"Total Units",null,{"$f":"Targeting!A47","v":""}]
[]
["Use this tab to provide clarifications, details, or comments on line items in the Sources & Uses of Funds, 15-Year Op Pro Forma, or 15-Year Commercial Op Pro Forma tabs, if needed."]
[]
["Sources & Uses of Funds"]
[]
[]
[]
[]
[]
[]
[]
[]
["15-Year Op Pro Forma"]
[]
[]
[]
[]
[]
[]
[]
[]
["15-Year Commercial Op Pro Forma"]

{"sheet":"Empowerment Budget","index":7,"n_rows":27,"n_cols":7,"rows_kept":27,"cut":false,"hidden":false,"merged":[[7,0,7,3],[8,0,8,3],[9,0,9,3],[10,0,10,3],[5,0,5,3],[3,4,3,5],[3,0,3,2],[0,0,0,7],[1,0,1,7],[21,0,21,3],[11,0,11,3],[14,0,14,3],[12,5,12,7],[6,5,6,7],[5,5,5,7],[7,5,7,7],[8,5,8,7],[9,5,9,7],[10,5,10,7],[11,5,11,7],[6,0,6,3],[22,0,22,3],[23,0,23,3],[24,0,24,3],[15,0,15,3],[16,0,16,3],[17,0,17,3],[18,0,18,3],[19,0,19,3],[25,5,25,7],[26,5,26,7],[12,0,12,3],[25,0,25,3],[26,0,26,3],[15,5,15,7],[16,5,16,7],[17,5,17,7],[18,5,18,7],[19,5,19,7],[20,5,20,7],[21,5,21,7],[22,5,22,7],[23,5,23,7],[24,5,24,7],[20,0,20,3]]}
["Rental Projects: Promotion of Empowerment Budget"]
[{"$f":"'Sources & Uses of Funds'!A2","v":"Version 5.2 Updated 1/27/22"}]
[]
["Project Name",null,null,{"$f":"IF(+Targeting!B5=\"\",\"\",+Targeting!B5)","v":""},"Total Units",null,{"$f":"Targeting!A47","v":""}]
[]
["Source of Revenue",null,null,null,"Year 1","Notes"]
[]
[]
[]
[]
[]
[]
["Total Revenue",null,null,null,{"$f":"SUM(E7:E12)","v":0}]
[]
["Expenses"]
[]
[]
[]
[]
[]
[]
[]
[]
[]
[]
["Total Expenses",null,null,null,{"$f":"SUM(E16:E25)","v":0}]
["Total Revenue minus Total Expenses",null,null,null,{"$f":"E13-E26","v":0}]

{"sheet":"Benchmarks","index":8,"n_rows":44,"n_cols":8,"rows_kept":44,"cut":false,"hidden":false,"merged":[[39,2,39,4],[36,0,37,0],[36,1,37,1],[36,2,37,2],[36,4,37,4],[36,5,37,5],[38,2,38,3],[34,0,35,0],[34,2,35,2],[34,4,35,4],[34,5,35,5],[0,0,0,5],[1,0,1,5],[18,2,19,2],[18,3,19,3],[18,4,19,4],[11,0,14,0],[8,2,9,4],[11,5,14,5],[16,1,17,1],[16,2,17,2],[16,4,17,4],[16,5,17,5],[3,1,3,2],[16,0,17,0],[18,5,19,5],[8,5,10,5],[31,1,32,1],[31,0,32,0],[31,4,32,4],[31,5,32,5],[23,4,26,4],[23,5,26,5],[11,1,14,1],[11,4,14,4],[23,0,26,0],[23,1,26,1],[23,3,24,3],[25,3,26,3],[15,2,15,3]]}
["Rental Projects: Benchmarks"]
[{"$f":"Targeting!A2:M2","v":"Version 5.2 Updated 1/27/22"}]
[]
["Project Name",{"$f":"IF(+Targeting!B5=\"\",\"\",+Targeting!B5)","v":""},null,"Total Units",{"$f":"'15-Year Op Pro Forma'!H4","v":""}]
[]
["Criterion","Per Schedules","Feasibility Benchmark","Oversubsidization Benchmark","Within Benchmarks?","Provide detailed explanations and supporting documentation for all benchmark deviations. Deviation explanations must be quantifiable in relation to the amount the benchmark is exceeded. Third-party supporting documentation is preferred."]
[]
["Development Budget"]
["Building type",{"$f":"IF('Sources & Uses of Funds'!C8=\"\",\"\",'Sources & Uses of Funds'!C8)","v":""},"To ensure consistent and reasonable cost assumptions, the per square foot construction cost should not be greater than the gross residential square footage cost estimates included in the application Reference Guide and on the next tab.\nCalculation takes total new construction or rehab costs minus environmental remediation and hard cost contingency, and divides it by total residential square footage. Off-site work, environmental remediation, and hard cost continency line items cannot be used to explain benchmark deviation."]
["Total construction hard costs",{"$f":"IF('Sources & Uses of Funds'!D28=0,\"\",SUM('Sources & Uses of Funds'!D19:'Sources & Uses of Funds'!D25))","v":""}]
["Construction costs per square foot (excluding land costs and soft costs) ",{"$f":"IF('Sources & Uses of Funds'!D94=0,0,(('Sources & Uses of Funds'!D28-'Sources & Uses of Funds'!D26-'Sources & Uses of Funds'!D27)/'Sources & Uses of Funds'!L4))","v":0},"N/A",{"$f":"IF(B9=\"Apartments\",(VLOOKUP(H11,'Cost Estimates by City Zip'!A14:G922,4)),IF(B9=\"Condos\",(VLOOKUP(H11,'Cost Estimates by City Zip'!A14:G922,5)),IF(B9=\"Single Family Homes\",(VLOOKUP(H11,'Cost Estimates by City Zip'!A14:G922,6)),IF(B9=\"Townhomes\",(VLOOKUP(H11,'Cost Estimates by City Zip'!A14:G922,7,FALSE))))))","v":false},{"$f":"IF(B11>0,(IF(B11<=D11,\"Yes\",\"No\")),\"Yes\")","v":"Yes"},null,null,{"$f":"LEFT(Targeting!N6,3)","v":""}]
["Construction/rehabilitation hard cost contingency as % of construction/rehabilitation hard costs",{"$f":"IF('Sources & Uses of Funds'!D28=0,0,'Sources & Uses of Funds'!D27/('Sources & Uses of Funds'!D28-'Sources & Uses of Funds'!D27))","v":0},"New Construction =","New Construction =",{"$f":"IF('Sources & Uses of Funds'!C7=\"New\",IF(B12>=C13,IF(B12<=D13,\"Yes\",\"No\"),\"No\"),IF(B12>=C15,IF(B12<=D15,\"Yes\",\"No\"),\"No\"))","v":"No"}]
[null,null,0.05,0.1]
[null,null,"Rehab =","Rehab ="]
[null,null,7.4999999999999997E-2,0.2]
["Capitalized replacement reserves ",{"$f":"+'Sources & Uses of Funds'!D57","v":0},"$0 on new construction projects. Variable on rehabilitation projects depending on age and condition of building (Exceptions made if reserves required by funding agency)",null,{"$f":"IF('Sources & Uses of Funds'!C7=\"Rehab\",\"Yes\",IF(B16=0,\"Yes\",\"No\"))","v":"Yes"}]
["Capitalized operating reserves ",{"$f":"+'Sources & Uses of Funds'!D55+'Sources & Uses of Funds'!D56+'Sources & Uses of Funds'!D58","v":0},0,"12 months operating expense and debt service payments (must be covered by financing sources other than AHP. Must provide documentation for benchmark deviation.):",{"$f":"IF(B17<=D18,\"Yes\", \"No\")","v":"Yes"}]
[null,null,null,{"$f":"('15-Year Op Pro Forma'!F37+'15-Year Op Pro Forma'!F39)","v":0}]
["Total developer fee",{"$f":"IF(+'Sources & Uses of Funds'!D92=0,0,'Sources & Uses of Funds'!D76)","v":0},0,"Not greater than 15% of total residential development costs (excluding developer fee and all capitalized reserves)",{"$f":"IF(B20=\"\",\"\",IF(B20>0.15,\"No\",\"Yes\"))","v":"Yes"}]
["Total developer fee as percentage of total residential development costs",{"$f":"IF('Sources & Uses of Funds'!D92=0,0,('Sources & Uses of Funds'!D76)/('Sources & Uses of Funds'!D92-('Sources & Uses of Funds'!D59+'Sources & Uses of Funds'!D76)))","v":0}]
["Soft cost contingency as % of soft costs",{"$f":"IF('Sources & Uses of Funds'!D72=0,0,('Sources & Uses of Funds'!D72/('Sources & Uses of Funds'!D92-'Sources & Uses of Funds'!D17-'Sources & Uses of Funds'!D28)))","v":0},0,0.1,{"$f":"IF(B21>D21,\"No\", \"Yes\")","v":"Yes"}]
["15-Year Operating Pro Forma"]
["Pro forma assumptions for income compared to expense increases. Expense increase minus income increase =                                                                                                       ",{"$f":"IF('15-Year Op Pro Forma'!E17=\"\",\"0%\",'15-Year Op Pro Forma'!E17-'15-Year Op Pro Forma'!E6)","v":"0%"},"Expenses increase 1% faster than revenues; e.g., 4% cost increase versus 3% income increase","Expenses increase 2% faster than revenues; e.g., 5% cost increase versus 3% income increase",{"$f":"IF(B23>=0.01,IF(B23<=0.02,\"Yes\",\"No\"),\"No\")","v":"No"}]
["Vacancy and bad debt rate: residential",{"$f":"IF(+'15-Year Op Pro Forma'!E10=\"\",\"\",'15-Year Op Pro Forma'!E10)","v":""},"Projects with No Project-Based Rental Subsidies","All Projects",{"$f":"IF('15-Year Op Pro Forma'!O4=\"Yes\",IF(B24>=C27,IF(B24<=D26,\"Yes\",\"No\"),\"No\"),IF(B24>=C25,IF(B24<=D26,\"Yes\",\"No\"),\"No\"))","v":"No"}]
[null,null,0.05]
[null,null,"Projects with Project-Based Rental Subsidies",0.1]
[null,null,0.03]
["Vacancy and bad debt rate: commercial",{"$f":"IF(+'15-Year Commercial Op Pro Forma'!E8=\"\",\"\",'15-Year Commercial Op Pro Forma'!E8)","v":""},"10% of gross rents","50% of gross rents",{"$f":"IF(B28=\"\",\"N/A\",IF(B28>=0.1,IF(B28<=0.5,\"Yes\",\"No\"),\"No\"))","v":"N/A"}]
["Management fees per unit per month",{"$f":"IF('15-Year Op Pro Forma'!E18=\"\",\"$0\",'15-Year Op Pro Forma'!E18)","v":"$0"},"Not less than $25","Not greater than $65",{"$f":"IF(B29>=25,IF(B29<=65,\"Yes\",\"No\"),\"No\")","v":"No"}]
["Operating reserves per unit per year",{"$f":"IF('15-Year Op Pro Forma'!E28=\"\",\"$0\",'15-Year Op Pro Forma'!E28)","v":"$0"},"$0, but if zero, must have adequate cushion built into debt service coverage ratio ","Not greater than $300 per unit per year",{"$f":"IF(B30=\"$0\",\"Yes\",IF(B30<301,\"Yes\",\"No\"))","v":"Yes"}]
["Annual replacement reserves per unit",{"$f":"IF('15-Year Op Pro Forma'!E29=\"\",\"$0\",'15-Year Op Pro Forma'!E29)","v":"$0"},250,600,{"$f":"IF(B31<250,\"No\",IF(B31>600,\"No\",\"Yes\"))","v":"No"}]
["Operating cost per unit per year ",{"$f":"IF('15-Year Op Pro Forma'!E37=\"\",\"$0\",'15-Year Op Pro Forma'!E37)","v":"$0"},"Projects Located in SF Bay Area and LA Metro*\nNot less than $5,000","Projects Located in SF Bay Area and LA Metro*\nNot greater than $10,000",{"$f":"IF(H32=\"Higher Cost\",(IF(OR(B32<5000,B32>10000),\"No\",\"Yes\")),(IF(OR(B32<4000,B32>8000),\"No\",\"Yes\")))","v":"No"},null,null,{"$f":"IF(OR(Targeting!I6=\"San Francisco\",Targeting!I6=\"Solano\",Targeting!I6=\"Alameda\",Targeting!I6=\"Napa\",Targeting!I6=\"Sonoma\",Targeting!I6=\"Marin\",Targeting!I6=\"Contra Costa\",Targeting!I6=\"San Mateo\",Targeting!I6=\"Santa Clara\",Targeting!I6=\"Los Angeles\",Targeting!I6=\"Ventura\",Targeting!I6=\"Orange\",Targeting!I6=\"Riverside\",Targeting!I6=\"San Bernardino\"),\"Higher Cost\",\"Lower Cost\")","v":"Lower Cost"}]
[null,null,"All Other Projects\nNot less than $4,000","All Other Projects\nNot greater than $8,000"]
["Debt service coverage ratio in Year 1                                                                      (defined as net operating income divided by debt service payment)",{"$f":"IF('15-Year Op Pro Forma'!F40=0,\"\",ROUND('15-Year Op Pro Forma'!F40,2))","v":""},1.05,1.45,{"$f":"IF('Sources & Uses of Funds'!O102>0,IF(B34>=C34,IF(B34<=D34,\"Yes\",\"No\"),\"No\"),\"N/A\")","v":"N/A"}]
["Net cashflow in Year 1",{"$f":"IF(+'15-Year Op Pro Forma'!F47=0,0,ROUND('15-Year Op Pro Forma'!F47,0))","v":0},0,"Not to exceed 10% of gross income in year one unless cashflow is needed by project to cover deficits throughout the retention period, or in order to meet minimum underwriting requirements for other lenders.",{"$f":"IF(B36>=0,IF(B36<D36,\"Yes\",\"No\"),\"No\")","v":"Yes"}]
[null,{"$f":"ROUNDDOWN(IF('15-Year Op Pro Forma'!F47=0,0,'15-Year Op Pro Forma'!F47/'15-Year Op Pro Forma'!F15),B44)","v":0},null,0.1]
["Net cashflow in Years 1  through 5",{"$f":"IF(+SUM('15-Year Op Pro Forma'!F47:J47)=0,0,SUM('15-Year Op Pro Forma'!F47:J47))","v":0},0,"Not to exceed the amount of the subsidy request.",{"$f":"IF(B37>=0,IF(B37<D38,\"Yes\",\"No\"),\"No\")","v":"No"}]
[null,null,null,{"$f":"'Sources & Uses of Funds'!E94","v":0}]
["Term of permanent financing",{"$f":"MIN(IF('Sources & Uses of Funds'!H97:N97=\"hard\",'Sources & Uses of Funds'!H99:N99,\"\"))","v":0},"Not less than 15 years, unless extenuating circumstances",null,{"$f":"IF(OR(B39=\"\",B39=0),\"N/A\",IF(B39>=15,\"Yes\", \"No\"))","v":"N/A"}]
["Interest rate assumptions",{"$f":"MAX(IF('Sources & Uses of Funds'!H97:N97=\"Hard\",'Sources & Uses of Funds'!H101:N101))","v":0},"To ensure consistent and reasonable rate assumptions, interest rates and spreads should be set in accordance with the Interest Rate Assumptions Guidelines included in the application package."]
["*SF Bay Area includes the following nine counties: San Francisco, Solano, Alameda, Napa, Sonoma, Marin, Contra Costa, San Mateo, and Santa Clara. LA Metro includes the following five counties: Los Angeles, Ventura, Orange, Riverside, and San Bernardino."]
[]
[]
[null,3]

{"sheet":"Cost Estimates by City Zip","index":9,"n_rows":922,"n_cols":12,"rows_kept":922,"cut":false,"hidden":false,"merged":[[5,0,5,10],[6,0,6,10],[8,0,8,10]]}
[]
[]
[]
[]
[]
["2022 Gross Residential Square Footage Cost Estimates"]
["Construction Costs by ZIP Code and City"]
[]
["(Source: RSMeans, The Gordian Group, Bank Portfolio)"]
[]
["Note: Use cost estimates by ZIP code and city."]
[]
["First Three Digits of ZIP Code","State","City","Apartments","Condos","Single-Family Homes","Townhomes","Apartments before Boost","Condos before Boost","Single-Family Homes before Boost","Townhomes before Boost"]
["010","MA","SPRINGFIELD",{"$f":"H14","v":331.84715278359153},{"$f":"I14","v":343.45020008371699},{"$f":"J14","v":218.96110560066973},{"$f":"K14","v":305.1601439933026},331.84715278359153,343.45020008371699,218.96110560066973,305.1601439933026]
["011","MA","SPRINGFIELD",{"$f":"H15","v":331.84715278359153},343.45020008371699,218.96110560066973,305.1601439933026,331.84715278359153,343.45020008371699,218.96110560066973,305.1601439933026]
["012","MA","PITTSFIELD",322.62425139905287,333.9048196297889,212.87560308222126,296.67894446835976,322.62425139905287,333.9048196297889,212.87560308222126,296.67894446835976]
["013","MA","GREENFIELD",324.17028861616586,335.5049140922556,213.89571735928908,298.10065002115954,324.17028861616586,335.5049140922556,213.89571735928908,298.10065002115954]
["014","MA","FITCHBURG",325.23882119205302,336.61080794701996,214.60076205298017,299.08325165562928,325.23882119205302,336.61080794701996,214.60076205298017,299.08325165562928]
["015","MA","WORCESTER",341.79082524271854,353.74155339805822,225.52219101941751,314.30415048543694,341.79082524271854,353.74155339805822,225.52219101941751,314.30415048543694]
["016","MA","WORCESTER",341.79082524271854,353.74155339805822,225.52219101941751,314.30415048543694,341.79082524271854,353.74155339805822,225.52219101941751,314.30415048543694]
["017","MA","FRAMINGHAM",336.39375221238936,348.15577152051486,221.96106636363638,309.34110780370071,336.39375221238936,348.15577152051486,221.96106636363638,309.34110780370071]
["018","MA","LOWELL",349.80400000000009,362.03490909090897,230.80948545454547,321.67290909090906,349.80400000000009,362.03490909090897,230.80948545454547,321.67290909090906]
["019","MA","LAWRENCE",349.84832050274952,362.08077926158694,230.83872923802048,321.71366535742345,349.84832050274952,362.08077926158694,230.83872923802048,321.71366535742345]
["020","MA","BOSTON",370.64147030257743,383.60096227119908,244.55857293985801,340.83463877474776,370.64147030257743,383.60096227119908,244.55857293985801,340.83463877474776]
["021","MA","BOSTON",370.64147030257743,383.60096227119908,244.55857293985801,340.83463877474776,370.64147030257743,383.60096227119908,244.55857293985801,340.83463877474776]
["022","MA","BOSTON",370.64147030257743,383.60096227119908,244.55857293985801,340.83463877474776,370.64147030257743,383.60096227119908,244.55857293985801,340.83463877474776]
["023","MA","BROCKTON",339.79710823909539,351.67812600969313,224.20668634895003,312.47076736672062,339.79710823909539,351.67812600969313,224.20668634895003,312.47076736672062]
["024","MA","BOSTON",370.64147030257743,383.60096227119908,244.55857293985801,340.83463877474776,370.64147030257743,383.60096227119908,244.55857293985801,340.83463877474776]
["025","MA","BUZZARDS BAY",322.60799999999995,333.88800000000003,212.86488,296.66400000000004,322.60799999999995,333.88800000000003,212.86488,296.66400000000004]
["026","MA","HYANNIS",331.46170909090904,343.0512793388429,218.70678014876037,304.80569752066111,331.46170909090904,343.0512793388429,218.70678014876037,304.80569752066111]
["027","MA","NEW BEDFORD",336.47333605553297,348.2381380155166,222.01357778685181,309.41429154757049,336.47333605553297,348.2381380155166,222.01357778685181,309.41429154757049]
["028","RI","NEWPORT",332.51756091578073,344.14404905968917,219.4034577636958,305.77663818479147,332.51756091578073,344.14404905968917,219.4034577636958,305.77663818479147]
["029","RI","PROVIDENCE",342.03506194690266,353.994329847144,225.68334454545459,314.52874577634748,342.03506194690266,353.994329847144,225.68334454545459,314.52874577634748]
["030","NH","NASHUA",313.38593831023678,324.34348860080456,206.77993153330351,288.18357264193105,313.38593831023678,324.34348860080456,206.77993153330351,288.18357264193105]
["031","NH","MANCHESTER",315.31747317073177,326.34255964523283,208.05440686031045,289.95977427937919,315.31747317073177,326.34255964523283,208.05440686031045,289.95977427937919]
["032","NH","CONCORD",316.32852928028609,327.38896736700934,208.7215271345552,290.8895216808225,316.32852928028609,327.38896736700934,208.7215271345552,290.8895216808225]
["033","NH","CONCORD",316.32852928028609,327.38896736700934,208.7215271345552,290.8895216808225,316.32852928028609,327.38896736700934,208.7215271345552,290.8895216808225]
["034","NH","KEENE",294.35386046511633,304.64595348837219,194.22208744186048,270.68204651162796,294.35386046511633,304.64595348837219,194.22208744186048,270.68204651162796]
["035","NH","LITTLETON",284.47300145560411,294.41960989810769,187.70244791848617,261.59580203784566,284.47300145560411,294.41960989810769,187.70244791848617,261.59580203784566]
["036","NH","CHARLESTON",292.8060776426567,303.04405238540699,193.20082137043968,269.2587357343312,292.8060776426567,303.04405238540699,193.20082137043968,269.2587357343312]
["037","NH","CLAREMONT",291.50368391345251,301.69612041392287,192.34146920037631,268.06107996237063,291.50368391345251,301.69612041392287,192.34146920037631,268.06107996237063]
["038","NH","PORTSMOUTH",303.93085427135674,314.55780721790768,200.54122905436267,279.48886249428961,303.93085427135674,314.55780721790768,200.54122905436267,279.48886249428961]
["039","ME","KITTERY",290.01907407407413,300.15960113960114,191.36188625356129,266.69586182336184,290.01907407407413,300.15960113960114,191.36188625356129,266.69586182336184]
["040","ME","PORTLAND",306.76745529573594,317.49359009628608,202.41288982118297,282.09734525447044,306.76745529573594,317.49359009628608,202.41288982118297,282.09734525447044]
["041","ME","PORTLAND",306.76745529573594,317.49359009628608,202.41288982118297,282.09734525447044,306.76745529573594,317.49359009628608,202.41288982118297,282.09734525447044]
["042","ME","LEWISTON",299.65763280521907,310.13517241379316,197.72164995340168,275.55929170549865,299.65763280521907,310.13517241379316,197.72164995340168,275.55929170549865]
["043","ME","AUGUSTA",306.64454661791586,317.36638391224864,202.3317915813528,281.9843208409506,306.64454661791586,317.36638391224864,202.3317915813528,281.9843208409506]
["044","ME","BANGOR",296.19538280883046,306.55186472522314,195.43717024424615,272.37547440112729,296.19538280883046,306.55186472522314,195.43717024424615,272.37547440112729]
["045","ME","BATH",291.48926375176302,301.68119605077572,192.33195441466859,268.04781946403386,291.48926375176302,301.68119605077572,192.33195441466859,268.04781946403386]
["046","ME","MACHIAS",290.26342358490569,300.41249433962264,191.52311421226418,266.92056084905659,290.26342358490569,300.41249433962264,191.52311421226418,266.92056084905659]
["047","ME","HOULTON",290.69115511551166,300.85518151815188,191.80534224422445,267.31389438943899,290.69115511551166,300.85518151815188,191.80534224422445,267.31389438943899]
["048","ME","ROCKLAND",288.86948365703455,298.96981525343438,190.60335755566081,265.63872098531505,288.86948365703455,298.96981525343438,190.60335755566081,265.63872098531505]
["049","ME","WATERVILLE",290.99874753173481,301.17352891396331,192.00829946403388,267.59675035260932,290.99874753173481,301.17352891396331,192.00829946403388,267.59675035260932]
["050","VT","WHITE RIVER JCT.",288.94667078972407,299.04970123691737,190.65428756898197,265.70970076117987,288.94667078972407,299.04970123691737,190.65428756898197,265.70970076117987]
["051","VT","BELLOWS FALLS",299.44199999999989,309.91199999999986,197.57936999999998,275.36099999999993,299.44199999999989,309.91199999999986,197.57936999999998,275.36099999999993]
["052","VT","BENNINGTON",296.10077276908925,306.45394664213433,195.37474415823368,272.28847286108555,296.10077276908925,306.45394664213433,195.37474415823368,272.28847286108555]
["053","VT","BRATTLEBORO",301.09415725259822,311.62192498870314,198.66950494803436,276.88029145955716,301.09415725259822,311.62192498870314,198.66950494803436,276.88029145955716]
["054","VT","BURLINGTON",304.9954986072425,315.659676880223,201.24370818941512,280.46788857938731,304.9954986072425,315.659676880223,201.24370818941512,280.46788857938731]
["056","VT","MONTPELIER",305.3431158088236,316.01944852941187,201.47307477022065,280.78755055147064,305.3431158088236,316.01944852941187,201.47307477022065,280.78755055147064]
["057","VT","RUTLAND",297.83850236966816,308.25243601895727,196.52134189573462,273.8864549763033,297.83850236966816,308.25243601895727,196.52134189573462,273.8864549763033]
["058","VT","ST. JOHNSBURY",288.73240419447097,298.82794280266921,190.51290907530984,265.51266539561493,288.73240419447097,298.82794280266921,190.51290907530984,265.51266539561493]
["059","VT","GUILDHALL",286.46464677574596,296.48089316650623,189.01658564003853,263.42728007699708,286.46464677574596,296.48089316650623,189.01658564003853,263.42728007699708]
["060","CT","NEW BRITAIN",342.7258421052631,354.70926315789467,226.13913868421051,315.16397368421048,342.7258421052631,354.70926315789467,226.13913868421051,315.16397368421048]
["061","CT","HARTFORD",348.08943405275784,360.26039328537166,229.67817167865707,320.09622781774584,348.08943405275784,360.26039328537166,229.67817167865707,320.09622781774584]
["062","CT","WILLIMANTIC",342.92437066881547,354.91473327961307,226.27013282836421,315.34653666398054,342.92437066881547,354.91473327961307,226.27013282836421,315.34653666398054]
["063","CT","NEW LONDON",334.9257160443168,346.63640541649573,220.99241914238817,307.99113048830526,334.9257160443168,346.63640541649573,220.99241914238817,307.99113048830526]
["064","CT","MERIDEN",338.87920357578213,350.72812677773254,223.60102974400644,311.62668021129616,338.87920357578213,350.72812677773254,223.60102974400644,311.62668021129616]
["065","CT","NEW HAVEN",345.6211458333334,357.70580128205131,228.04953297275642,317.82643830128205,345.6211458333334,357.70580128205131,228.04953297275642,317.82643830128205]
["066","CT","BRIDGEPORT",344.76317557251906,356.81783206106871,227.48342259541985,317.03746564885495,344.76317557251906,356.81783206106871,227.48342259541985,317.03746564885495]
["067","CT","WATERBURY",344.61044247787618,356.65975864843125,227.3826454545455,316.89701528559942,344.61044247787618,356.65975864843125,227.3826454545455,316.89701528559942]
["068","CT","NORWALK",344.10424435483867,356.13586129032251,227.04864318951613,316.43152540322575,344.10424435483867,356.13586129032251,227.04864318951613,316.43152540322575]
["069","CT","STAMFORD",345.1869473684211,357.25642105263165,227.76303789473687,317.42715789473687,345.1869473684211,357.25642105263165,227.76303789473687,317.42715789473687]
["070","NJ","NEWARK",375.40546681334797,388.53153208654186,247.70197777044373,345.21551668500183,375.40546681334797,388.53153208654186,247.70197777044373,345.21551668500183]
["071","NJ","NEWARK",375.40546681334797,388.53153208654186,247.70197777044373,345.21551668500183,375.40546681334797,388.53153208654186,247.70197777044373,345.21551668500183]
["072","NJ","ELIZABETH",366.19497756170523,378.99899775617041,241.62466508975317,336.74573111443527,366.19497756170523,378.99899775617041,241.62466508975317,336.74573111443527]
["073","NJ","JERSEY CITY",366.94833345878823,379.77869476853601,242.12174827625145,337.43850244636809,366.94833345878823,379.77869476853601,242.12174827625145,337.43850244636809]
["074","NJ","PATERSON",369.67573393124053,382.60145889387138,243.92135576980559,339.94656651718964,369.67573393124053,382.60145889387138,243.92135576980559,339.94656651718964]
["075","NJ","PATERSON",369.67573393124053,382.60145889387138,243.92135576980559,{"$f":"K78","v":339.94656651718964},369.67573393124053,382.60145889387138,243.92135576980559,339.94656651718964]
["076","NJ","HACKENSACK",{"$f":"H79","v":363.65233810240971},376.36745481927716,239.94696756400603,334.40756965361447,363.65233810240971,376.36745481927716,239.94696756400603,334.40756965361447]
["077","NJ","LONG BRANCH",349.1863714618068,361.3956851492826,230.40195859635517,321.10494998061256,349.1863714618068,361.3956851492826,230.40195859635517,321.10494998061256]
["078","NJ","DOVER",363.94379253112038,376.66909996227849,240.13927653338368,334.67558543945682,363.94379253112038,376.66909996227849,240.13927653338368,334.67558543945682]
["079","NJ","SUMMIT",362.32114285714283,374.98971428571429,239.06861142857144,333.18342857142858,362.32114285714283,374.98971428571429,239.06861142857144,333.18342857142858]
["080","NJ","VINELAND",349.50980544747097,361.73042801556431,230.61536848249034,321.40237354085616,349.50980544747097,361.73042801556431,230.61536848249034,321.40237354085616]
["081","NJ","CAMDEN",368.24533333333335,381.12104428904439,242.97754144522148,338.63119813519825,368.24533333333335,381.12104428904439,242.97754144522148,338.63119813519825]
["082","NJ","ATLANTIC CITY",363.38101876675603,376.08664879356564,239.76794423592497,334.15806970509379,363.38101876675603,376.08664879356564,239.76794423592497,334.15806970509379]
["083","NJ","VINELAND",344.02152432018386,356.05024894676365,226.99406242818844,316.35545767905012,344.02152432018386,356.05024894676365,226.99406242818844,316.35545767905012]
["084","NJ","ATLANTIC CITY",363.38101876675603,376.08664879356564,239.76794423592497,334.15806970509379,363.38101876675603,376.08664879356564,239.76794423592497,334.15806970509379]
["085","NJ","TRENTON",369.07213507290874,381.97675518035311,243.52308604758252,339.39150882578667,369.07213507290874,381.97675518035311,243.52308604758252,339.39150882578667]
["086","NJ","TRENTON",369.07213507290874,381.97675518035311,243.52308604758252,339.39150882578667,369.07213507290874,381.97675518035311,243.52308604758252,339.39150882578667]
["087","NJ","POINT PLEASANT",354.24489588935842,366.6310810603149,233.73970036112178,325.75666999615828,354.24489588935842,366.6310810603149,233.73970036112178,325.75666999615828]
["088","NJ","NEW BRUNSWICK",363.31572771718686,376.0190748401655,239.7248635577285,334.09802933433627,363.31572771718686,376.0190748401655,239.7248635577285,334.09802933433627]
["089","NJ","NEW BRUNSWICK",363.31572771718686,376.0190748401655,239.7248635577285,334.09802933433627,363.31572771718686,376.0190748401655,239.7248635577285,334.09802933433627]
["100","NY","NEW YORK",419.25473501473954,433.9139914837865,276.63482882738293,385.53844513593191,419.25473501473954,433.9139914837865,276.63482882738293,385.53844513593191]
["101","NY","NEW YORK",419.25473501473954,433.9139914837865,276.63482882738293,385.53844513593191,419.25473501473954,433.9139914837865,276.63482882738293,385.53844513593191]
["102","NY","NEW YORK",419.25473501473954,433.9139914837865,276.63482882738293,385.53844513593191,419.25473501473954,433.9139914837865,276.63482882738293,385.53844513593191]
["103","NY","STATEN ISLAND",397.63124626121646,411.53443668993026,262.36710658025925,365.6539082751745,397.63124626121646,411.53443668993026,262.36710658025925,365.6539082751745]
["104","NY","BRONX",394.53296642041624,408.3278253861651,260.32278354264599,362.80479079919405,394.53296642041624,408.3278253861651,260.32278354264599,362.80479079919405]
["105","NY","MOUNT VERNON",365.42989558232932,378.20716465863455,241.11984473895586,336.04217670682738,365.42989558232932,378.20716465863455,241.11984473895586,336.04217670682738]
["106","NY","WHITE PLAINS",370.65599999999995,383.61599999999999,244.56816000000001,340.84800000000001,370.65599999999995,383.61599999999999,244.56816000000001,340.84800000000001]
["107","NY","YONKERS",381.81000000000006,395.16,251.92785000000003,351.10500000000002,381.81000000000006,395.16,251.92785000000003,351.10500000000002]
["108","NY","NEW ROCHELLE",359.75841012281353,372.33737551172305,237.37765585411239,330.82678972832156,359.75841012281353,372.33737551172305,237.37765585411239,330.82678972832156]
["109","NY","SUFFERN",335.49692398582118,347.22758566364706,221.3693165222528,308.5164021268215,335.49692398582118,347.22758566364706,221.3693165222528,308.5164021268215]
["110","NY","QUEENS",412.80972744970808,427.2436340038937,272.3822505840364,379.61174237508118,412.80972744970808,427.2436340038937,272.3822505840364,379.61174237508118]
["111","NY","LONG ISLAND CITY",415.86288853092782,430.40354896907223,274.39680312822162,382.41936952319594,415.86288853092782,430.40354896907223,274.39680312822162,382.41936952319594]
["112","NY","BROOKLYN",417.17839060489052,431.76504761904755,275.26480451415694,383.62907947232935,417.17839060489052,431.76504761904755,275.26480451415694,383.62907947232935]
["113","NY","FLUSHING",415.62807459807078,430.16052475884248,274.24186698392288,382.20343922829585,415.62807459807078,430.16052475884248,274.24186698392288,382.20343922829585]
["114","NY","JAMAICA",412.45285714285711,426.87428571428569,272.14677857142857,379.28357142857146,412.45285714285711,426.87428571428569,272.14677857142857,379.28357142857146]
["115","NY","HICKSVILLE",387.70529032258059,401.26141935483861,255.81771096774193,356.52619354838703,387.70529032258059,401.26141935483861,255.81771096774193,356.52619354838703]
["116","NY","FAR ROCKAWAY",415.48355912596401,430.0109562982006,274.1465120372751,382.07054562982017,415.48355912596401,430.0109562982006,274.1465120372751,382.07054562982017]
["117","NY","HICKSVILLE",359.1755629820052,371.73414910025713,236.99307863753219,330.29081491002569,359.1755629820052,371.73414910025713,236.99307863753219,330.29081491002569]
["118","NY","HICKSVILLE",359.1755629820052,371.73414910025713,236.99307863753219,330.29081491002569,359.1755629820052,371.73414910025713,236.99307863753219,330.29081491002569]
["119","NY","RIVERHEAD",395.5999649982499,409.43213160658036,261.0268160658033,363.78598179909,395.5999649982499,409.43213160658036,261.0268160658033,363.78598179909]
["120","NY","ALBANY",336.32523012552298,348.08485355648537,221.91585376569037,309.2780962343096,336.32523012552298,348.08485355648537,221.91585376569037,309.2780962343096]
["121","NY","ALBANY",336.32523012552298,348.08485355648537,221.91585376569037,309.2780962343096,336.32523012552298,348.08485355648537,221.91585376569037,309.2780962343096]
["122","NY","ALBANY",336.32523012552298,348.08485355648537,221.91585376569037,309.2780962343096,336.32523012552298,348.08485355648537,221.91585376569037,309.2780962343096]
["123","NY","SCHENECTADY",335.17530365392702,346.89471986560278,221.15710333053346,308.22064636707273,335.17530365392702,346.89471986560278,221.15710333053346,308.22064636707273]
["124","NY","KINGSTON",358.85635285285281,371.4037777777778,236.78245575825827,329.99727552552548,358.85635285285281,371.4037777777778,236.78245575825827,329.99727552552548]
["125","NY","POUGHKEEPSIE",360.89511740588893,373.51382780469623,238.12768393589263,331.87208348863203,360.89511740588893,373.51382780469623,238.12768393589263,331.87208348863203]
["126","NY","POUGHKEEPSIE",360.89511740588893,373.51382780469623,238.12768393589263,331.87208348863203,360.89511740588893,373.51382780469623,238.12768393589263,331.87208348863203]
["127","NY","MONTICELLO",357.17314285714281,369.66171428571431,235.67183142857144,328.44942857142854,357.17314285714281,369.66171428571431,235.67183142857144,328.44942857142854]
["128","NY","GLENS FALLS",311.51269868995638,322.40475109170302,205.54392087336251,286.46097816593903,311.51269868995638,322.40475109170302,205.54392087336251,286.46097816593903]
["129","NY","PLATTSBURGH",306.96434682080923,317.69736594041791,202.54280380613599,282.27840284570919,306.96434682080923,317.69736594041791,202.54280380613599,282.27840284570919]
["130","NY","SYRACUSE",323.94798156277432,335.27483406496924,213.74903356892014,297.89622080772608,323.94798156277432,335.27483406496924,213.74903356892014,297.89622080772608]
["131","NY","SYRACUSE",323.94798156277432,335.27483406496924,213.74903356892014,297.89622080772608,323.94798156277432,335.27483406496924,213.74903356892014,297.89622080772608]
["132","NY","SYRACUSE",323.94798156277432,335.27483406496924,213.74903356892014,297.89622080772608,323.94798156277432,335.27483406496924,213.74903356892014,297.89622080772608]
["133","NY","UTICA",321.25384883720932,332.48650089445437,211.97137697227194,295.4187491055456,321.25384883720932,332.48650089445437,211.97137697227194,295.4187491055456]
["134","NY","UTICA",321.25384883720932,332.48650089445437,211.97137697227194,295.4187491055456,321.25384883720932,332.48650089445437,211.97137697227194,295.4187491055456]
["135","NY","UTICA",321.25384883720932,332.48650089445437,211.97137697227194,295.4187491055456,321.25384883720932,332.48650089445437,211.97137697227194,295.4187491055456]
["136","NY","WATERTOWN",318.75091954022992,329.89605658709104,210.31988121131744,293.11710433244912,318.75091954022992,329.89605658709104,210.31988121131744,293.11710433244912]
["137","NY","BINGHAMTON",321.46250976986545,332.70245766391668,212.10905670864096,295.61062961354764,321.46250976986545,332.70245766391668,212.10905670864096,295.61062961354764]
["138","NY","BINGHAMTON",321.46250976986545,332.70245766391668,212.10905670864096,295.61062961354764,321.46250976986545,332.70245766391668,212.10905670864096,295.61062961354764]
["139","NY","BINGHAMTON",321.46250976986545,332.70245766391668,212.10905670864096,295.61062961354764,321.46250976986545,332.70245766391668,212.10905670864096,295.61062961354764]
["140","NY","BUFFALO",345.68848039215692,357.77549019607847,228.09396200980396,317.88835784313727,345.68848039215692,357.77549019607847,228.09396200980396,317.88835784313727]
["141","NY","BUFFALO",345.68848039215692,357.77549019607847,228.09396200980396,317.88835784313727,345.68848039215692,357.77549019607847,228.09396200980396,317.88835784313727]
["142","NY","BUFFALO",345.68848039215692,357.77549019607847,228.09396200980396,317.88835784313727,345.68848039215692,357.77549019607847,228.09396200980396,317.88835784313727]
["143","NY","NIAGARA FALLS",323.66549830795259,334.9824737732655,213.56264400592215,297.63645473773261,323.66549830795259,334.9824737732655,213.56264400592215,297.63645473773261]
["144","NY","ROCHESTER",331.99171182053493,343.59981363244179,219.05648929249352,305.29307765314934,331.99171182053493,343.59981363244179,219.05648929249352,305.29307765314934]
["145","NY","ROCHESTER",331.99171182053493,343.59981363244179,219.05648929249352,305.29307765314934,331.99171182053493,343.59981363244179,219.05648929249352,305.29307765314934]
["146","NY","ROCHESTER",331.99171182053493,343.59981363244179,219.05648929249352,305.29307765314934,331.99171182053493,343.59981363244179,219.05648929249352,305.29307765314934]
["147","NY","JAMESTOWN",307.91431889236264,318.68055381866901,203.16961929432784,283.15197856185796,307.91431889236264,318.68055381866901,203.16961929432784,283.15197856185796]
["148","NY","ELMIRA",322.22857416267942,333.49530752501096,212.61452528055682,296.31508742931709,322.22857416267942,333.49530752501096,212.61452528055682,296.31508742931709]
["149","NY","ELMIRA",322.22857416267942,333.49530752501096,212.61452528055682,296.31508742931709,322.22857416267942,333.49530752501096,212.61452528055682,296.31508742931709]
["150","PA","PITTSBURGH",{"$f":"H143","v":330.42347198641761},341.97674023769099,218.0217251697793,303.850955008489,330.42347198641761,341.97674023769099,218.0217251697793,303.850955008489]
["151","PA","PITTSBURGH",330.42347198641761,341.97674023769099,218.0217251697793,303.850955008489,330.42347198641761,341.97674023769099,218.0217251697793,303.850955008489]
["152","PA","PITTSBURGH",330.42347198641761,341.97674023769099,218.0217251697793,303.850955008489,330.42347198641761,341.97674023769099,218.0217251697793,303.850955008489]
["153","PA","WASHINGTON",314.88599999999997,325.89599999999996,207.76971,289.56299999999993,314.88599999999997,325.89599999999996,207.76971,289.56299999999993]
["154","PA","UNIONTOWN",312.13957536041931,323.05354652686754,205.95754988204453,287.03744167758839,312.13957536041931,323.05354652686754,205.95754988204453,287.03744167758839]
["155","PA","BEDFORD",302.42895421903046,313.00339317773779,199.5502375897666,278.10774461400354,302.42895421903046,313.00339317773779,199.5502375897666,278.10774461400354]
["156","PA","GREENSBURG",309.56587037037042,320.38985185185186,204.25935453703704,284.67071296296297,309.56587037037042,320.38985185185186,204.25935453703704,284.67071296296297]
["157","PA","INDIANA",308.15787207763566,318.93262284958092,203.33032181737977,283.37594530216143,308.15787207763566,318.93262284958092,203.33032181737977,283.37594530216143]
["158","PA","DUBOIS",307.98977464788743,318.758647887324,203.21940690140849,283.22136619718316,307.98977464788743,318.758647887324,203.21940690140849,283.22136619718316]
["159","PA","JOHNSTOWN",312.13105074090709,323.04472384373594,205.9519251234845,287.02960260440057,312.13105074090709,323.04472384373594,205.9519251234845,287.02960260440057]
["160","PA","BUTLER",302.42924028906958,313.00368925022593,199.55042634598016,278.10800767841016,302.42924028906958,313.00368925022593,199.55042634598016,278.10800767841016]
["161","PA","NEW CASTLE",303.22747873799716,313.82983813443059,200.07712417009597,278.8420521262002,303.22747873799716,313.82983813443059,200.07712417009597,278.8420521262002]
["162","PA","KITTANNING",301.14144484958979,311.67086599817685,198.70070649498629,276.92377620783952,301.14144484958979,311.67086599817685,198.70070649498629,276.92377620783952]
["163","PA","OIL CITY",297.15844830741094,307.54860384263509,196.07262510521505,273.2610905763953,297.15844830741094,307.54860384263509,196.07262510521505,273.2610905763953]
["164","PA","ERIE",305.43694431661294,316.11655775425675,201.53498518177636,280.87383341003226,305.43694431661294,316.11655775425675,201.53498518177636,280.87383341003226]
["165","PA","ERIE",305.43694431661294,316.11655775425675,201.53498518177636,280.87383341003226,305.43694431661294,316.11655775425675,201.53498518177636,280.87383341003226]
["166","PA","ALTOONA",306.00414048059145,316.70358595194079,201.90923548983363,281.39541589648798,306.00414048059145,316.70358595194079,201.90923548983363,281.39541589648798]
["167","PA","BRADFORD",304.78657681940695,315.44345013477084,201.10585633423176,280.27576819407005,304.78657681940695,315.44345013477084,201.10585633423176,280.27576819407005]
["168","PA","STATE COLLEGE",309.29442138649756,320.10891164476664,204.08024566379703,284.42109379247847,309.29442138649756,320.10891164476664,204.08024566379703,284.42109379247847]
["169","PA","WELLSBORO",298.32016043755698,308.75093527803097,196.83915201458524,274.32937830446673,298.32016043755698,308.75093527803097,196.83915201458524,274.32937830446673]
["170","PA","HARRISBURG",321.03182222222216,332.25671111111114,211.82487822222222,295.21457777777772,321.03182222222216,332.25671111111114,211.82487822222222,295.21457777777772]
["171","PA","HARRISBURG",321.03182222222216,332.25671111111114,211.82487822222222,295.21457777777772,321.03182222222216,332.25671111111114,211.82487822222222,295.21457777777772]
["172","PA","CHAMBERSBURG",294.09442491864252,304.37744676894476,194.0509053370526,270.44347466294749,294.09442491864252,304.37744676894476,194.0509053370526,270.44347466294749]
["173","PA","YORK",308.06852197553235,318.8401486180336,203.27136637063893,283.29378069777982,308.06852197553235,318.8401486180336,203.27136637063893,283.29378069777982]
["174","PA","YORK",308.06852197553235,318.8401486180336,203.27136637063893,283.29378069777982,308.06852197553235,318.8401486180336,203.27136637063893,283.29378069777982]
["175","PA","LANCASTER",307.27393003180373,318.01777373920953,202.74707460245344,282.56308950477057,307.27393003180373,318.01777373920953,202.74707460245344,282.56308950477057]
["176","PA","LANCASTER",307.27393003180373,318.01777373920953,202.74707460245344,282.56308950477057,307.27393003180373,318.01777373920953,202.74707460245344,282.56308950477057]
["177","PA","WILLIAMSPORT",299.90285181733458,310.38896551724139,197.88345163094132,275.78479030754897,299.90285181733458,310.38896551724139,197.88345163094132,275.78479030754897]
["178","PA","SUNBURY",297.35828571428567,307.75542857142852,196.20448285714286,273.44485714285719,297.35828571428567,307.75542857142852,196.20448285714286,273.44485714285719]
["179","PA","POTTSVILLE",299.82355029585796,310.30689121529355,197.83112649066905,275.71186618115604,299.82355029585796,310.30689121529355,197.83112649066905,275.71186618115604]
["180","PA","LEHIGH VALLEY",320.36923544303806,331.57095696202526,211.38768678481011,294.60527594936707,320.36923544303806,331.57095696202526,211.38768678481011,294.60527594936707]
["181","PA","ALLENTOWN",328.08310179640711,339.55453892215559,216.47748999999996,301.69879640718551,328.08310179640711,339.55453892215559,216.47748999999996,301.69879640718551]
["182","PA","HAZLETON",300.5266757246377,311.03460144927533,198.29506634963766,276.35844655797098,300.5266757246377,311.03460144927533,198.29506634963766,276.35844655797098]
["183","PA","STROUDSBURG",310.91852920662592,321.78980645161283,205.15187289014818,285.91459154315601,310.91852920662592,321.78980645161283,205.15187289014818,285.91459154315601]
["184","PA","SCRANTON",316.05333658536586,327.10415254988914,208.53994806651886,290.6364598669623,316.05333658536586,327.10415254988914,208.53994806651886,290.6364598669623]
["185","PA","SCRANTON",316.05333658536586,327.10415254988914,208.53994806651886,290.6364598669623,316.05333658536586,327.10415254988914,208.53994806651886,290.6364598669623]
["186","PA","WILKES-BARRE",305.61686999999989,316.3027745454545,201.65370467727271,281.03928954545449,305.61686999999989,316.3027745454545,201.65370467727271,281.03928954545449]
["187","PA","WILKES-BARRE",305.61686999999989,316.3027745454545,201.65370467727271,281.03928954545449,305.61686999999989,316.3027745454545,201.65370467727271,281.03928954545449]
["188","PA","MONTROSE",300.69444705882347,311.20823891402711,198.40576609954746,276.51272579185519,300.69444705882347,311.20823891402711,198.40576609954746,276.51272579185519]
["189","PA","DOYLESTOWN",336.80472538860107,348.58111438820242,222.23223681147866,309.71903068951769,336.80472538860107,348.58111438820242,222.23223681147866,309.71903068951769]
["190","PA","PHILADELPHIA",374.59435024065164,387.69205479452046,247.1667826360607,344.46962976675303,374.59435024065164,387.69205479452046,247.1667826360607,344.46962976675303]
["191","PA","PHILADELPHIA",374.59435024065164,387.69205479452046,247.1667826360607,344.46962976675303,374.59435024065164,387.69205479452046,247.1667826360607,344.46962976675303]
["193","PA","WESTCHESTER",341.11628571428571,353.04342857142871,225.07711285714288,313.68385714285711,341.11628571428571,353.04342857142871,225.07711285714288,313.68385714285711]
["194","PA","NORRISTOWN",339.57979135263787,351.45321063070213,224.06329519635068,312.27092701309004,339.57979135263787,351.45321063070213,224.06329519635068,312.27092701309004]
["195","PA","READING",319.7297659388646,330.90912838427948,210.96574870742359,294.01723231441053,319.7297659388646,330.90912838427948,210.96574870742359,294.01723231441053]
["196","PA","READING",319.7297659388646,330.90912838427948,210.96574870742359,294.01723231441053,319.7297659388646,330.90912838427948,210.96574870742359,294.01723231441053]
["197","DE","NEWARK",335.83460251046029,347.57707112970706,221.59212531380754,308.82692468619246,335.83460251046029,347.57707112970706,221.59212531380754,308.82692468619246]
["198","DE","WILMINGTON",337.20336523929473,348.99369269521412,222.49526942065495,310.08561209068012,337.20336523929473,348.99369269521412,222.49526942065495,310.08561209068012]
["199","DE","DOVER",338.38148538011706,350.21300584795324,223.27262274853805,311.16898830409366,338.38148538011706,350.21300584795324,223.27262274853805,311.16898830409366]
["200","DC","WASHINGTON",314.68763693131143,325.69070115967895,207.6388250535237,289.38058920606608,314.68763693131143,325.69070115967895,207.6388250535237,289.38058920606608]
["201","DC","WASHINGTON",314.68763693131143,325.69070115967895,207.6388250535237,289.38058920606608,314.68763693131143,325.69070115967895,207.6388250535237,289.38058920606608]
["202","DC","WASHINGTON",314.68763693131143,325.69070115967895,207.6388250535237,289.38058920606608,314.68763693131143,325.69070115967895,207.6388250535237,289.38058920606608]
["203","DC","WASHINGTON",314.68763693131143,325.69070115967895,207.6388250535237,289.38058920606608,314.68763693131143,325.69070115967895,207.6388250535237,289.38058920606608]
["204","DC","WASHINGTON",314.68763693131143,325.69070115967895,207.6388250535237,289.38058920606608,314.68763693131143,325.69070115967895,207.6388250535237,289.38058920606608]
["205","DC","WASHINGTON",314.68763693131143,325.69070115967895,207.6388250535237,289.38058920606608,314.68763693131143,325.69070115967895,207.6388250535237,289.38058920606608]
["206","MD","WALDORF",297.37319611470866,307.77086031452365,196.21432111470867,273.45856845513418,297.37319611470866,307.77086031452365,196.21432111470867,273.45856845513418]
["207","MD","COLLEGE PARK",297.20425390984371,307.59601103955845,196.10284879484823,273.30321251149957,297.20425390984371,307.59601103955845,196.10284879484823,273.30321251149957]
["208","MD","COLLEGE PARK",297.20425390984371,307.59601103955845,196.10284879484823,273.30321251149957,297.20425390984371,307.59601103955845,196.10284879484823,273.30321251149957]
["209","MD","SILVER SPRING",295.59653481894156,305.93207799442905,195.04203526462399,271.8247855153204,295.59653481894156,305.93207799442905,195.04203526462399,271.8247855153204]
["210","MD","BALTIMORE",306.27672029250448,316.98569652650815,202.08909051188292,281.64607495429607,306.27672029250448,316.98569652650815,202.08909051188292,281.64607495429607]
["211","MD","BALTIMORE",306.27672029250448,316.98569652650815,202.08909051188292,281.64607495429607,306.27672029250448,316.98569652650815,202.08909051188292,281.64607495429607]
["212","MD","BALTIMORE",306.27672029250448,316.98569652650815,202.08909051188292,281.64607495429607,306.27672029250448,316.98569652650815,202.08909051188292,281.64607495429607]
["214","MD","ANNAPOLIS",302.12276116681863,312.68649407474936,199.34820370556065,277.82617547857802,302.12276116681863,312.68649407474936,199.34820370556065,277.82617547857802]
["215","MD","CUMBERLAND",291.82624011299436,302.02995480225985,192.55429990112998,{"$f":"K206","v":268.35769632768364},291.82624011299436,302.02995480225985,192.55429990112998,268.35769632768364]
["216","MD","EASTON",{"$f":"H207","v":280.81114285714284},290.62971428571433,185.28626142857144,258.22842857142859,280.81114285714284,290.62971428571433,185.28626142857144,258.22842857142859]
["217","MD","HAGERSTOWN",299.55200000000008,310.0258461538462,197.65195076923078,275.46215384615391,299.55200000000008,310.0258461538462,197.65195076923078,275.46215384615391]
["218","MD","SALISBURY",272.44486345381523,281.97090763052211,179.76597965863456,250.53496184738952,272.44486345381523,281.97090763052211,179.76597965863456,250.53496184738952]
["219","MD","ELKTON",289.46200655737709,299.58305573770497,190.99431908196723,266.18359344262296,289.46200655737709,299.58305573770497,190.99431908196723,266.18359344262296]
["220","VA","FAIRFAX",299.58050231267345,310.05534505087871,197.67075731267346,275.48836401480111,299.58050231267345,310.05534505087871,197.67075731267346,275.48836401480111]
["221","VA","FAIRFAX",299.58050231267345,310.05534505087871,197.67075731267346,275.48836401480111,299.58050231267345,310.05534505087871,197.67075731267346,275.48836401480111]
["222","VA","ARLINGTON",300.60648484848491,311.1172011019284,198.34772641873283,276.43183746556474,300.60648484848491,311.1172011019284,198.34772641873283,276.43183746556474]
["223","VA","ALEXANDRIA",301.86339650413993,312.41806071757139,199.17706837166517,277.58766881324755,301.86339650413993,312.41806071757139,199.17706837166517,277.58766881324755]
["224","VA","FREDERICKSBURG",291.82548850305028,302.02917691224781,192.55380396996719,268.35700516189587,291.82548850305028,302.02917691224781,192.55380396996719,268.35700516189587]
["225","VA","FREDERICKSBURG",291.82548850305028,302.02917691224781,192.55380396996719,268.35700516189587,291.82548850305028,302.02917691224781,192.55380396996719,268.35700516189587]
["226","VA","WINCHESTER",287.85710056925996,297.92203415559771,189.93536170777986,264.70775332068314,287.85710056925996,297.92203415559771,189.93536170777986,264.70775332068314]
["227","VA","CULPEPER",295.1797926885701,305.5007644608977,194.76705831559465,271.44155761221657,295.1797926885701,305.5007644608977,194.76705831559465,271.44155761221657]
["228","VA","HARRISONBURG",287.49475207823957,297.5470161369193,189.69627505134474,264.37454474327626,287.49475207823957,297.5470161369193,189.69627505134474,264.37454474327626]
["229","VA","CHARLOTTESVILLE",282.49495535285638,292.37240134421501,186.39728330292843,259.77682957273157,282.49495535285638,292.37240134421501,186.39728330292843,259.77682957273157]
["230","VA","RICHMOND",284.34801344860711,294.29025168107597,187.61997768491835,261.4808655139289,284.34801344860711,294.29025168107597,187.61997768491835,261.4808655139289]
["231","VA","RICHMOND",284.34801344860711,294.29025168107597,187.61997768491835,261.4808655139289,284.34801344860711,294.29025168107597,187.61997768491835,261.4808655139289]
["232","VA","RICHMOND",284.34801344860711,294.29025168107597,187.61997768491835,261.4808655139289,284.34801344860711,294.29025168107597,187.61997768491835,261.4808655139289]
["233","VA","NORFOLK",284.53511506172839,294.48389530864199,187.74343203950622,261.6529204938272,284.53511506172839,294.48389530864199,187.74343203950622,261.6529204938272]
["234","VA","NORFOLK",284.53511506172839,294.48389530864199,187.74343203950622,261.6529204938272,284.53511506172839,294.48389530864199,187.74343203950622,261.6529204938272]
["235","VA","NORFOLK",284.53511506172839,294.48389530864199,187.74343203950622,261.6529204938272,284.53511506172839,294.48389530864199,187.74343203950622,261.6529204938272]
["236","VA","NEWPORT NEWS",281.19674362818591,291.02879760119936,185.54069052473767,258.58301949025491,281.19674362818591,291.02879760119936,185.54069052473767,258.58301949025491]
["237","VA","PORTSMOUTH",277.27298395185557,286.96784353059178,182.951695110331,254.97480692076232,277.27298395185557,286.96784353059178,182.951695110331,254.97480692076232]
["238","VA","PETERSBURG",281.03669397590352,290.86315180722886,185.43508573493975,258.43584096385536,281.03669397590352,290.86315180722886,185.43508573493975,258.43584096385536]
["239","VA","FARMVILLE",272.78224016145316,282.32008072653895,179.98858930373368,250.84520686175586,272.78224016145316,282.32008072653895,179.98858930373368,250.84520686175586]
["240","VA","ROANOKE",283.78730769230776,293.70994082840241,187.25000991124267,260.96525147928998,283.78730769230776,293.70994082840241,187.25000991124267,260.96525147928998]
["241","VA","ROANOKE",283.78730769230776,293.70994082840241,187.25000991124267,260.96525147928998,283.78730769230776,293.70994082840241,187.25000991124267,260.96525147928998]
["242","VA","BRISTOL",265.78116048092005,275.07420805018296,175.36910067956092,244.40715107161532,265.78116048092005,275.07420805018296,175.36910067956092,244.40715107161532]
["243","VA","PULASKI",277.62428571428569,287.33142857142855,183.18349285714285,255.29785714285711,277.62428571428569,287.33142857142855,183.18349285714285,255.29785714285711]
["244","VA","STAUNTON",277.25657142857148,286.95085714285716,182.94086571428574,254.95971428571428,277.25657142857148,286.95085714285716,182.94086571428574,254.95971428571428]
["245","VA","LYNCHBURG",279.52117629917433,289.29464400194263,184.43510901894123,257.0422005828072,279.52117629917433,289.29464400194263,184.43510901894123,257.0422005828072]
["246","VA","GRUNDY",270.42337078651678,279.87873340143,178.43214790602656,248.67603677221649,270.42337078651678,279.87873340143,178.43214790602656,248.67603677221649]
["247","WV","BLUEFIELD",295.47427767527665,305.80554612546121,194.96136692343174,271.71236023985239,295.47427767527665,305.80554612546121,194.96136692343174,271.71236023985239]
["248","WV","BLUEFIELD",295.47427767527665,305.80554612546121,194.96136692343174,271.71236023985239,295.47427767527665,305.80554612546121,194.96136692343174,271.71236023985239]
["249","WV","LEWISBURG",300.48443113772458,310.99087977890377,198.26719230769231,276.31959926301244,300.48443113772458,310.99087977890377,198.26719230769231,276.31959926301244]
["250","WV","CHARLESTON",303.33470469181236,313.94081324747009,200.14787455381784,278.94065501379941,303.33470469181236,313.94081324747009,200.14787455381784,278.94065501379941]
["251","WV","CHARLESTON",303.33470469181236,313.94081324747009,200.14787455381784,278.94065501379941,303.33470469181236,313.94081324747009,200.14787455381784,278.94065501379941]
["252","WV","CHARLESTON",303.33470469181236,313.94081324747009,200.14787455381784,278.94065501379941,303.33470469181236,313.94081324747009,200.14787455381784,278.94065501379941]
["253","WV","CHARLESTON",303.33470469181236,313.94081324747009,200.14787455381784,278.94065501379941,303.33470469181236,313.94081324747009,200.14787455381784,278.94065501379941]
["254","WV","MARTINSBURG",288.4558549222798,298.54172397550633,190.33043490343857,265.2583560998587,288.4558549222798,298.54172397550633,190.33043490343857,265.2583560998587]
["255","WV","HUNTINGTON",306.18342857142864,316.88914285714282,202.02753428571427,281.56028571428578,306.18342857142864,316.88914285714282,202.02753428571427,281.56028571428578]
["256","WV","HUNTINGTON",306.18342857142864,316.88914285714282,202.02753428571427,281.56028571428578,306.18342857142864,316.88914285714282,202.02753428571427,281.56028571428578]
["257","WV","HUNTINGTON",306.18342857142864,316.88914285714282,202.02753428571427,281.56028571428578,306.18342857142864,316.88914285714282,202.02753428571427,281.56028571428578]
["258","WV","BECKLEY",294.99877138849928,305.31341374474056,194.6476159046284,271.27509396914456,294.99877138849928,305.31341374474056,194.6476159046284,271.27509396914456]
["259","WV","BECKLEY",294.99877138849928,305.31341374474056,194.6476159046284,271.27509396914456,294.99877138849928,305.31341374474056,194.6476159046284,271.27509396914456]
["260","WV","WHEELING",309.01795444394827,319.82277802590443,203.89782581509604,284.16686020544887,309.01795444394827,319.82277802590443,203.89782581509604,284.16686020544887]
["261","WV","PARKERSBURG",306.03120546697039,316.73159726651488,201.92709364920276,281.42030432801823,306.03120546697039,316.73159726651488,201.92709364920276,281.42030432801823]
["262","WV","BUCKHANNON",305.12592908438052,315.79466786355476,201.32976950179531,280.58782989228007,305.12592908438052,315.79466786355476,201.32976950179531,280.58782989228007]
["263","WV","CLARKSBURG",307.76022648238961,318.52107356219352,203.06794524297811,283.01027819884075,307.76022648238961,318.52107356219352,203.06794524297811,283.01027819884075]
["264","WV","CLARKSBURG",307.76022648238961,318.52107356219352,203.06794524297811,283.01027819884075,307.76022648238961,318.52107356219352,203.06794524297811,283.01027819884075]
["265","WV","MORGANTOWN",308.17372650334073,318.94903162583518,203.3407829665924,283.39052472160353,308.17372650334073,318.94903162583518,203.3407829665924,283.39052472160353]
["266","WV","GASSAWAY",301.83060562103356,312.38412330009066,199.15543212148685,277.55751495920219,301.83060562103356,312.38412330009066,199.15543212148685,277.55751495920219]
["267","WV","ROMNEY",298.96559452054794,309.41893698630133,197.26502567123293,274.9229068493151,298.96559452054794,309.41893698630133,197.26502567123293,274.9229068493151]
["268","WV","PETERSBURG",298.67556209751609,309.11876356945726,197.07365497700093,274.65619871205155,298.67556209751609,309.11876356945726,197.07365497700093,274.65619871205155]
["270","NC","GREENSBORO",279.58542857142857,289.36114285714285,184.47750428571428,257.10128571428567,279.58542857142857,289.36114285714285,184.47750428571428,257.10128571428567]
["271","NC","WINSTON-SALEM",279.25351057401815,289.01761933534749,184.25849643504532,256.79606042296075,279.25351057401815,289.01761933534749,184.25849643504532,256.79606042296075]
["272","NC","GREENSBORO",279.58542857142857,289.36114285714285,184.47750428571428,257.10128571428567,279.58542857142857,289.36114285714285,184.47750428571428,257.10128571428567]
["273","NC","GREENSBORO",279.58542857142857,289.36114285714285,184.47750428571428,257.10128571428567,279.58542857142857,289.36114285714285,184.47750428571428,257.10128571428567]
["274","NC","GREENSBORO",279.58542857142857,289.36114285714285,184.47750428571428,257.10128571428567,279.58542857142857,289.36114285714285,184.47750428571428,257.10128571428567]
["275","NC","RALEIGH",278.20864028411978,287.9362151192289,183.56906471334347,255.83521816336889,278.20864028411978,287.9362151192289,183.56906471334347,255.83521816336889]
["276","NC","RALEIGH",278.20864028411978,287.9362151192289,183.56906471334347,255.83521816336889,278.20864028411978,287.9362151192289,183.56906471334347,255.83521816336889]
["277","NC","DURHAM",283.8941683266932,293.82053784860557,187.32051924800797,261.06351842629482,283.8941683266932,293.82053784860557,187.32051924800797,261.06351842629482]
["278","NC","ROCKY MOUNT",272.54022598870063,282.06960451977403,179.82890225988703,250.62265536723169,272.54022598870063,282.06960451977403,179.82890225988703,250.62265536723169]
["279","NC","ELIZABETH CITY",275.60327951564079,285.23975782038343,181.84998208879921,253.43937941473257,275.60327951564079,285.23975782038343,181.84998208879921,253.43937941473257]
["280","NC","GASTONIA",281.0020734319225,290.82732075471699,185.41224222845489,258.40400458949517,281.0020734319225,290.82732075471699,185.41224222845489,258.40400458949517]
["281","NC","CHARLOTTE",{"$f":"H271","v":285.11902414982745},295.08822079842287,188.12870995564316,262.18987185805815,285.11902414982745,295.08822079842287,188.12870995564316,262.18987185805815]
["282","NC","CHARLOTTE",285.11902414982745,295.08822079842287,188.12870995564316,262.18987185805815,285.11902414982745,295.08822079842287,188.12870995564316,262.18987185805815]
["283","NC","FAYETTEVILLE",281.19723671013043,291.02930792377128,185.54101587261783,258.58347291875629,281.19723671013043,291.02930792377128,185.54101587261783,258.58347291875629]
["284","NC","WILMINGTON",270.79546943005175,280.26384248704659,178.67766795854919,249.0182113989637,270.79546943005175,280.26384248704659,178.67766795854919,249.0182113989637]
["285","NC","KINSTON",267.76002092050209,277.12225941422594,176.67480261506276,246.22687238493722,267.76002092050209,277.12225941422594,176.67480261506276,246.22687238493722]
["286","NC","HICKORY",276.07843226473631,285.7315243019649,182.16349983453981,253.87632057911063,276.07843226473631,285.7315243019649,182.16349983453981,253.87632057911063]
["287","NC","ASHEVILLE",273.19999589533091,282.75244330425852,180.26423505387379,251.22936685479729,273.19999589533091,282.75244330425852,180.26423505387379,251.22936685479729]
["288","NC","ASHEVILLE",273.19999589533091,282.75244330425852,180.26423505387379,251.22936685479729,273.19999589533091,282.75244330425852,180.26423505387379,251.22936685479729]
["289","NC","MURPHY",267.63668368942155,276.99460969254812,176.59342160500256,246.11345388223029,267.63668368942155,276.99460969254812,176.59342160500256,246.11345388223029]
["290","SC","COLUMBIA",279.94214364640885,289.73033048719236,184.71287387242594,257.42931391260674,279.94214364640885,289.73033048719236,184.71287387242594,257.42931391260674]
["291","SC","COLUMBIA",279.94214364640885,289.73033048719236,184.71287387242594,257.42931391260674,279.94214364640885,289.73033048719236,184.71287387242594,257.42931391260674]
["292","SC","COLUMBIA",279.94214364640885,289.73033048719236,184.71287387242594,257.42931391260674,279.94214364640885,289.73033048719236,184.71287387242594,257.42931391260674]
["293","SC","SPARTANBURG",279.80227300303335,289.58556926188066,184.62058370070778,257.30069160768454,279.80227300303335,289.58556926188066,184.62058370070778,257.30069160768454]
["294","SC","CHARLESTON",283.55487125748505,293.46937724550901,187.09664250000003,260.75150748502995,283.55487125748505,293.46937724550901,187.09664250000003,260.75150748502995]
["295","SC","FLORENCE",275.03681133029841,284.65348305513402,181.47621211937278,252.91846636317652,275.03681133029841,284.65348305513402,181.47621211937278,252.91846636317652]
["296","SC","GREENVILLE",279.09514285714289,288.85371428571437,184.15400142857149,256.65042857142862,279.09514285714289,288.85371428571437,184.15400142857149,256.65042857142862]
["297","SC","ROCK HILL",274.92771428571416,284.54057142857135,181.40422714285711,252.81814285714279,274.92771428571416,284.54057142857135,181.40422714285711,252.81814285714279]
["298","SC","AIKEN",271.75595337050169,281.25790978205771,179.31141944247341,249.90145362392289,271.75595337050169,281.25790978205771,179.31141944247341,249.90145362392289]
["299","SC","BEAUFORT",275.6379183889772,285.27560784313727,181.87283768945417,253.47123264440913,275.6379183889772,285.27560784313727,181.87283768945417,253.47123264440913]
["300","GA","ATLANTA",295.27457142857139,305.59885714285707,194.82959571428566,271.52871428571427,295.27457142857139,305.59885714285707,194.82959571428566,271.52871428571427]
["301","GA","ATLANTA",295.27457142857139,305.59885714285707,194.82959571428566,271.52871428571427,295.27457142857139,305.59885714285707,194.82959571428566,271.52871428571427]
["302","GA","ATLANTA",295.27457142857139,305.59885714285707,194.82959571428566,271.52871428571427,295.27457142857139,305.59885714285707,194.82959571428566,271.52871428571427]
["303","GA","ATLANTA",295.27457142857139,305.59885714285707,194.82959571428566,271.52871428571427,295.27457142857139,305.59885714285707,194.82959571428566,271.52871428571427]
["304","GA","STATESBORO",284.33827108433729,294.28016867469881,187.61354942771086,261.47190662650604,284.33827108433729,294.28016867469881,187.61354942771086,261.47190662650604]
["305","GA","GAINESVILLE",271.89975544041448,281.40673989637304,179.4063036683938,250.03369119170981,271.89975544041448,281.40673989637304,179.4063036683938,250.03369119170981]
["306","GA","ATHENS",269.75,279.18181818181819,177.98784090909095,248.05681818181824,269.75,279.18181818181819,177.98784090909095,248.05681818181824]
["307","GA","DALTON",278.45222333000993,288.18831505483553,183.72978693918247,256.05921236291124,278.45222333000993,288.18831505483553,183.72978693918247,256.05921236291124]
["308","GA","AUGUSTA",284.43169552238805,294.37685970149255,187.6751932238806,261.55781791044774,284.43169552238805,294.37685970149255,187.6751932238806,261.55781791044774]
["309","GA","AUGUSTA",284.43169552238805,294.37685970149255,187.6751932238806,261.55781791044774,284.43169552238805,294.37685970149255,187.6751932238806,261.55781791044774]
["310","GA","MACON",281.07411094452772,290.90187706146929,185.45977439280361,258.47024887556228,281.07411094452772,290.90187706146929,185.45977439280361,258.47024887556228]
["311","GA","MACON",281.07411094452772,290.90187706146929,185.45977439280361,258.47024887556228,281.07411094452772,290.90187706146929,185.45977439280361,258.47024887556228]
["312","GA","MACON",281.07411094452772,290.90187706146929,185.45977439280361,258.47024887556228,281.07411094452772,290.90187706146929,185.45977439280361,258.47024887556228]
["313","GA","SAVANNAH",286.56158976881454,296.58122577471721,189.08055106738809,263.51642695523856,286.56158976881454,296.58122577471721,189.08055106738809,263.51642695523856]
["314","GA","SAVANNAH",286.56158976881454,296.58122577471721,189.08055106738809,263.51642695523856,286.56158976881454,296.58122577471721,189.08055106738809,263.51642695523856]
["315","GA","WAYCROSS",277.4886629834254,287.19106378704168,183.09400556504269,255.17314113510798,277.4886629834254,287.19106378704168,183.09400556504269,255.17314113510798]
["316","GA","VALDOSTA",281.22679897698202,291.05990383631712,185.56052180051151,258.61065780051149,281.22679897698202,291.05990383631712,185.56052180051151,258.61065780051149]
["317","GA","ALBANY",282.49842472582253,292.37599202392823,186.39957248255237,259.78001994017944,282.49842472582253,292.37599202392823,186.39957248255237,259.78001994017944]
["318","GA","COLUMBUS",284.12057142857151,294.05485714285726,187.46990571428574,261.27171428571432,284.12057142857151,294.05485714285726,187.46990571428574,261.27171428571432]
["319","GA","COLUMBUS",284.12057142857151,294.05485714285726,187.46990571428574,261.27171428571432,284.12057142857151,294.05485714285726,187.46990571428574,261.27171428571432]
["320","FL","JACKSONVILLE",277.67145259938843,287.38024464831807,183.21461475535173,255.34123088685021,277.67145259938843,287.38024464831807,183.21461475535173,255.34123088685021]
["321","FL","DAYTONA BEACH",280.65989759036148,290.47318072289158,185.18646599397593,258.08934638554217,280.65989759036148,290.47318072289158,185.18646599397593,258.08934638554217]
["322","FL","JACKSONVILLE",277.67145259938843,287.38024464831807,183.21461475535173,255.34123088685021,277.67145259938843,287.38024464831807,183.21461475535173,255.34123088685021]
["323","FL","TALLAHASSEE",281.6691428571429,291.51771428571431,185.85239142857145,259.01742857142858,281.6691428571429,291.51771428571431,185.85239142857145,259.01742857142858]
["324","FL","PANAMA CITY",280.46094752623691,290.26727436281857,185.05519373313345,257.90639580209893,280.46094752623691,290.26727436281857,185.05519373313345,257.90639580209893]
["325","FL","PENSACOLA",285.27099154649432,295.2455017404277,188.22898186971659,262.32961810044753,285.27099154649432,295.2455017404277,188.22898186971659,262.32961810044753]
["326","FL","GAINESVILLE",280.38744911392405,290.19120607594937,185.00669763037973,257.83880810126584,280.38744911392405,290.19120607594937,185.00669763037973,257.83880810126584]
["327","FL","ORLANDO",284.06707443037965,293.99948962025309,187.43460704810124,261.2225194936708,284.06707443037965,293.99948962025309,187.43460704810124,261.2225194936708]
["328","FL","ORLANDO",284.06707443037965,293.99948962025309,187.43460704810124,261.2225194936708,284.06707443037965,293.99948962025309,187.43460704810124,261.2225194936708]
["329","FL","MELBOURNE",288.58031191760659,298.6705326140264,190.41255476213831,265.37280431584105,288.58031191760659,298.6705326140264,190.41255476213831,265.37280431584105]
["330","FL","MIAMI",286.12963417085427,296.13416683417086,188.79553588944722,263.11920904522611,286.12963417085427,296.13416683417086,188.79553588944722,263.11920904522611]
["331","FL","MIAMI",286.12963417085427,296.13416683417086,188.79553588944722,263.11920904522611,286.12963417085427,296.13416683417086,188.79553588944722,263.11920904522611]
["332","FL","MIAMI",286.12963417085427,296.13416683417086,188.79553588944722,263.11920904522611,286.12963417085427,296.13416683417086,188.79553588944722,263.11920904522611]
["333","FL","FORT LAUDERDALE",280.38948208802452,290.19331013306038,185.00803903787101,257.84067758444218,280.38948208802452,290.19331013306038,185.00803903787101,257.84067758444218]
["334","FL","WEST PALM BEACH",271.11873563218387,280.59841170323926,178.8909671368861,249.31548066875646,271.11873563218387,280.59841170323926,178.8909671368861,249.31548066875646]
["335","FL","TAMPA",282.69705929648245,292.58157185929656,186.53063657286438,259.96268040201011,282.69705929648245,292.58157185929656,186.53063657286438,259.96268040201011]
["336","FL","TAMPA",282.69705929648245,292.58157185929656,186.53063657286438,259.96268040201011,282.69705929648245,292.58157185929656,186.53063657286438,259.96268040201011]
["337","FL","ST. PETERSBURG",286.1494967548677,296.15472391412874,188.80864172241635,263.13747428856715,286.1494967548677,296.15472391412874,188.80864172241635,263.13747428856715]
["338","FL","LAKELAND",279.17051724137934,288.9317241379311,184.20373534482758,256.71974137931039,279.17051724137934,288.9317241379311,184.20373534482758,256.71974137931039]
["339","FL","FORT MYERS",280.43618543046358,290.24164645950071,185.03885507896078,257.88362506367804,280.43618543046358,290.24164645950071,185.03885507896078,257.88362506367804]
["340","FL","MIAMI",286.12963417085427,296.13416683417086,188.79553588944722,263.11920904522611,286.12963417085427,296.13416683417086,188.79553588944722,263.11920904522611]
["341","FL","FORT MYERS",280.43618543046358,290.24164645950071,185.03885507896078,257.88362506367804,280.43618543046358,290.24164645950071,185.03885507896078,257.88362506367804]
["342","FL","SARASOTA",278.83807734806629,288.58766047212447,183.98438313410344,256.4140361627322,278.83807734806629,288.58766047212447,183.98438313410344,256.4140361627322]
["344","FL","GAINESVILLE",280.38744911392405,290.19120607594937,185.00669763037973,257.83880810126584,280.38744911392405,290.19120607594937,185.00669763037973,257.83880810126584]
["346","FL","TAMPA",282.69705929648245,292.58157185929656,186.53063657286438,{"$f":"K334","v":259.96268040201011},282.69705929648245,292.58157185929656,186.53063657286438,259.96268040201011]
["347","FL","ORLANDO",{"$f":"H335","v":284.06707443037965},293.99948962025309,187.43460704810124,261.2225194936708,284.06707443037965,293.99948962025309,187.43460704810124,261.2225194936708]
["349","FL","WEST PALM BEACH",271.11873563218387,280.59841170323926,178.8909671368861,249.31548066875646,271.11873563218387,280.59841170323926,178.8909671368861,249.31548066875646]
["350","AL","BIRMINGHAM",286.912131147541,296.94402384500751,189.31184709388972,263.83877794336814,286.912131147541,296.94402384500751,189.31184709388972,263.83877794336814]
["351","AL","BIRMINGHAM",286.912131147541,296.94402384500751,189.31184709388972,263.83877794336814,286.912131147541,296.94402384500751,189.31184709388972,263.83877794336814]
["352","AL","BIRMINGHAM",286.912131147541,296.94402384500751,189.31184709388972,263.83877794336814,286.912131147541,296.94402384500751,189.31184709388972,263.83877794336814]
["354","AL","TUSCALOOSA",283.06450399201606,292.96186427145716,186.77308583333337,260.30057534930143,283.06450399201606,292.96186427145716,186.77308583333337,260.30057534930143]
["355","AL","JASPER",282.02677577577577,291.88785185185185,186.08836663163163,259.3463008008008,282.02677577577577,291.88785185185185,186.08836663163163,259.3463008008008]
["356","AL","DECATUR",280.87739656912214,290.69828456104949,185.329977295661,258.28935418768918,280.87739656912214,290.69828456104949,185.329977295661,258.28935418768918]
["357","AL","HUNTSVILLE",286.19602087475153,296.20287475149115,188.8393395079523,263.18025695825054,286.19602087475153,296.20287475149115,188.8393395079523,263.18025695825054]
["358","AL","HUNTSVILLE",286.19602087475153,296.20287475149115,188.8393395079523,263.18025695825054,286.19602087475153,296.20287475149115,188.8393395079523,263.18025695825054]
["359","AL","GADSDEN",283.80022033049568,293.72330495743603,187.25852999499244,260.97712568853274,283.80022033049568,293.72330495743603,187.25852999499244,260.97712568853274]
["360","AL","MONTGOMERY",283.46095398317664,293.37217615042056,187.0346735180604,260.66514299851565,283.46095398317664,293.37217615042056,187.0346735180604,260.66514299851565]
["361","AL","MONTGOMERY",283.46095398317664,293.37217615042056,187.0346735180604,260.66514299851565,283.46095398317664,293.37217615042056,187.0346735180604,260.66514299851565]
["362","AL","ANNISTON",273.2748230494646,282.82988679245284,180.31360789393167,251.29817644059156,273.2748230494646,282.82988679245284,180.31360789393167,251.29817644059156]
["363","AL","DOTHAN",280.79760475482908,290.61570282317979,185.27732864784545,258.21597919762263,280.79760475482908,290.61570282317979,185.27732864784545,258.21597919762263]
["364","AL","EVERGREEN",272.7978803245436,282.33626774847875,179.99890907707908,250.8595892494929,272.7978803245436,282.33626774847875,179.99890907707908,250.8595892494929]
["365","AL","MOBILE",279.20528128128126,288.96770370370365,184.22667353353347,256.7517097097097,279.20528128128126,288.96770370370365,184.22667353353347,256.7517097097097]
["366","AL","MOBILE",279.20528128128126,288.96770370370365,184.22667353353347,256.7517097097097,279.20528128128126,288.96770370370365,184.22667353353347,256.7517097097097]
["367","AL","SELMA",277.77728699106257,287.48977954319759,183.28444695134061,255.43855412115192,277.77728699106257,287.48977954319759,183.28444695134061,255.43855412115192]
["368","AL","PHENIX CITY",278.95912219451378,288.7129376558604,184.06425157107236,256.52534663341646,278.95912219451378,288.7129376558604,184.06425157107236,256.52534663341646]
["369","AL","BUTLER",275.7704184184185,285.41274074074079,181.9602645445446,253.59307707707708,275.7704184184185,285.41274074074079,181.9602645445446,253.59307707707708]
["370","TN","NASHVILLE",292.64610855745724,302.87848997555022,193.09526974083133,269.11163129584361,292.64610855745724,302.87848997555022,193.09526974083133,269.11163129584361]
["371","TN","NASHVILLE",292.64610855745724,302.87848997555022,193.09526974083133,269.11163129584361,292.64610855745724,302.87848997555022,193.09526974083133,269.11163129584361]
["372","TN","NASHVILLE",292.64610855745724,302.87848997555022,193.09526974083133,269.11163129584361,292.64610855745724,302.87848997555022,193.09526974083133,269.11163129584361]
["373","TN","CHATTANOOGA",279.80128264132065,289.58454427213604,184.61993023511752,257.29978089044516,279.80128264132065,289.58454427213604,184.61993023511752,257.29978089044516]
["374","TN","CHATTANOOGA",279.80128264132065,289.58454427213604,184.61993023511752,257.29978089044516,279.80128264132065,289.58454427213604,184.61993023511752,257.29978089044516]
["375","TN","MEMPHIS",286.05053003533561,296.05229681978795,188.74334098939926,263.04646643109533,286.05053003533561,296.05229681978795,188.74334098939926,263.04646643109533]
["376","TN","JOHNSON CITY",268.03476310272532,277.40660796645693,176.85608442348007,246.47951991614249,268.03476310272532,277.40660796645693,176.85608442348007,246.47951991614249]
["377","TN","KNOXVILLE",274.50615062761506,284.1042677824268,181.12606882845188,252.43048117154814,274.50615062761506,284.1042677824268,181.12606882845188,252.43048117154814]
["378","TN","KNOXVILLE",274.50615062761506,284.1042677824268,181.12606882845188,252.43048117154814,274.50615062761506,284.1042677824268,181.12606882845188,252.43048117154814]
["379","TN","KNOXVILLE",274.50615062761506,284.1042677824268,181.12606882845188,252.43048117154814,274.50615062761506,284.1042677824268,181.12606882845188,252.43048117154814]
["380","TN","MEMPHIS",286.05053003533561,296.05229681978795,188.74334098939926,263.04646643109533,286.05053003533561,296.05229681978795,188.74334098939926,263.04646643109533]
["381","TN","MEMPHIS",286.05053003533561,296.05229681978795,188.74334098939926,263.04646643109533,286.05053003533561,296.05229681978795,188.74334098939926,263.04646643109533]
["382","TN","MCKENZIE",257.46365906623237,266.46588490770904,169.88100385450599,236.75853963083605,257.46365906623237,266.46588490770904,169.88100385450599,236.75853963083605]
["383","TN","JACKSON",280.95762754303598,290.78132081377146,185.38291571205005,258.36313302034426,280.95762754303598,290.78132081377146,185.38291571205005,258.36313302034426]
["384","TN","COLUMBIA",266.4087780651837,275.723770305225,175.783218561821,244.98429591308843,266.4087780651837,275.723770305225,175.783218561821,244.98429591308843]
["385","TN","COOKEVILLE",258.71846153846155,267.76456159225387,170.70895411511566,237.91243141473913,258.71846153846155,267.76456159225387,170.70895411511566,237.91243141473913]
["386","MS","CLARKSDALE",255.73059814106068,264.6722274466922,168.73748662657189,235.16485073810827,255.73059814106068,264.6722274466922,168.73748662657189,235.16485073810827]
["387","MS","GREENVILLE",276.50890844714218,286.1770520991401,182.44753885685387,254.27217804754682,276.50890844714218,286.1770520991401,182.44753885685387,254.27217804754682]
["388","MS","TUPELO",260.92449361702131,270.04772765957449,172.16454961702129,239.94105531914894,260.92449361702131,270.04772765957449,172.16454961702129,239.94105531914894]
["389","MS","GREENWOOD",258.19891292590597,267.22684694429427,170.36614286100595,237.43466468361279,258.19891292590597,267.22684694429427,170.36614286100595,237.43466468361279]
["390","MS","JACKSON",279.5774569536423,289.35289251146202,184.47224441161481,257.09395517065707,279.5774569536423,289.35289251146202,184.47224441161481,257.09395517065707]
["391","MS","JACKSON",279.5774569536423,289.35289251146202,184.47224441161481,257.09395517065707,279.5774569536423,289.35289251146202,184.47224441161481,257.09395517065707]
["392","MS","JACKSON",279.5774569536423,289.35289251146202,184.47224441161481,257.09395517065707,279.5774569536423,289.35289251146202,184.47224441161481,257.09395517065707]
["393","MS","MERIDIAN",272.51530897703543,282.04381628392474,179.81246138830892,250.59974217118992,272.51530897703543,282.04381628392474,179.81246138830892,250.59974217118992]
["394","MS","LAUREL",259.5460705882353,268.6211080213904,171.25503140106952,238.6734844919786,259.5460705882353,268.6211080213904,171.25503140106952,238.6734844919786]
["395","MS","BILOXI",274.5040724262804,284.1021169167098,181.12469757889292,252.42857009829282,274.5040724262804,284.1021169167098,181.12469757889292,252.42857009829282]
["396","MS","MCCOMB",253.18780076628357,262.04052107279699,167.05968490421458,232.82654406130271,253.18780076628357,262.04052107279699,167.05968490421458,232.82654406130271]
["397","MS","COLUMBUS",260.11213708820407,269.20696705632309,171.62853632837408,239.1940281615303,260.11213708820407,269.20696705632309,171.62853632837408,239.1940281615303]
["398","GA","ALBANY",282.49842472582253,292.37599202392823,186.39957248255237,259.78001994017944,282.49842472582253,292.37599202392823,186.39957248255237,259.78001994017944]
["399","GA","ATLANTA",295.27457142857139,305.59885714285707,194.82959571428566,271.52871428571427,295.27457142857139,305.59885714285707,194.82959571428566,271.52871428571427]
["400","KY","LOUISVILLE",288.12512920526569,298.19943442223303,190.11221374939058,264.95422720624089,288.12512920526569,298.19943442223303,190.11221374939058,264.95422720624089]
["401","KY","LOUISVILLE",288.12512920526569,298.19943442223303,190.11221374939058,264.95422720624089,288.12512920526569,298.19943442223303,190.11221374939058,264.95422720624089]
["402","KY","LOUISVILLE",288.12512920526569,298.19943442223303,190.11221374939058,264.95422720624089,288.12512920526569,298.19943442223303,190.11221374939058,264.95422720624089]
["403","KY","LEXINGTON",281.14872323630982,290.97909817464233,185.50900546127281,258.53886087814504,281.14872323630982,290.97909817464233,185.50900546127281,258.53886087814504]
["404","KY","LEXINGTON",281.14872323630982,290.97909817464233,185.50900546127281,258.53886087814504,281.14872323630982,290.97909817464233,185.50900546127281,258.53886087814504]
["405","KY","LEXINGTON",281.14872323630982,290.97909817464233,185.50900546127281,258.53886087814504,281.14872323630982,290.97909817464233,185.50900546127281,258.53886087814504]
["406","KY","FRANKFORT",284.79329999999993,294.75110769230758,187.91378896153844,261.89034230769226,284.79329999999993,294.75110769230758,187.91378896153844,261.89034230769226]
["407","KY","CORBIN",270.58610526315783,280.04715789473687,178.53952421052631,248.82568421052625,270.58610526315783,280.04715789473687,178.53952421052631,248.82568421052625]
["408","KY","CORBIN",270.58610526315783,280.04715789473687,178.53952421052631,248.82568421052625,270.58610526315783,280.04715789473687,178.53952421052631,248.82568421052625]
["409","KY","CORBIN",270.58610526315783,280.04715789473687,178.53952421052631,248.82568421052625,270.58610526315783,280.04715789473687,178.53952421052631,248.82568421052625]
["410","KY","COVINGTON",275.54057142857141,285.17485714285715,181.80860571428576,253.38171428571431,275.54057142857141,285.17485714285715,181.80860571428576,253.38171428571431]
["411","KY","ASHLAND",287.53066666666666,297.58418648018642,189.71997240093242,264.40757109557109,287.53066666666666,297.58418648018642,189.71997240093242,264.40757109557109]
["412","KY","ASHLAND",287.53066666666666,297.58418648018642,189.71997240093242,264.40757109557109,287.53066666666666,297.58418648018642,189.71997240093242,264.40757109557109]
["413","KY","CAMPTON",{"$f":"H399","v":277.97299853444059},287.6923341475329,183.41358235466538,255.61852662432824,277.97299853444059,287.6923341475329,183.41358235466538,255.61852662432824]
["414","KY","CAMPTON",277.97299853444059,287.6923341475329,183.41358235466538,255.61852662432824,277.97299853444059,287.6923341475329,183.41358235466538,255.61852662432824]
["415","KY","PIKEVILLE",286.00374730931213,296.00387833411332,188.712472569022,263.0034459522696,286.00374730931213,296.00387833411332,188.712472569022,263.0034459522696]
["416","KY","PIKEVILLE",286.00374730931213,296.00387833411332,188.712472569022,263.0034459522696,286.00374730931213,296.00387833411332,188.712472569022,263.0034459522696]
["417","KY","HAZARD",277.72765608207129,287.43841328773806,183.25169922813873,255.39291450903758,277.72765608207129,287.43841328773806,183.25169922813873,255.39291450903758]
["418","KY","HAZARD",277.72765608207129,287.43841328773806,183.25169922813873,255.39291450903758,277.72765608207129,287.43841328773806,183.25169922813873,255.39291450903758]
["420","KY","PADUCAH",276.88885714285715,286.57028571428577,182.69823857142859,254.62157142857146,276.88885714285715,286.57028571428577,182.69823857142859,254.62157142857146]
["421","KY","BOWLING GREEN",281.94501860920667,291.80323604309507,186.03442119490697,259.27111851126347,281.94501860920667,291.80323604309507,186.03442119490697,259.27111851126347]
["422","KY","BOWLING GREEN",281.94501860920667,291.80323604309507,186.03442119490697,259.27111851126347,281.94501860920667,291.80323604309507,186.03442119490697,259.27111851126347]
["423","KY","OWENSBORO",284.548,294.49723076923078,187.75193384615386,261.66476923076925,284.548,294.49723076923078,187.75193384615386,261.66476923076925]
["424","KY","HENDERSON",275.26212652068131,284.88667639902678,181.6248807542579,253.12566180048663,275.26212652068131,284.88667639902678,181.6248807542579,253.12566180048663]
["425","KY","SOMERSET",273.25668740740747,282.81111703703704,180.30164154074077,251.28149925925931,273.25668740740747,282.81111703703704,180.30164154074077,251.28149925925931]
["426","KY","SOMERSET",273.25668740740747,282.81111703703704,180.30164154074077,251.28149925925931,273.25668740740747,282.81111703703704,180.30164154074077,251.28149925925931]
["427","KY","ELIZABETHTOWN",268.72173474533537,278.11759959657081,177.30936560766514,247.11124558749367,268.72173474533537,278.11759959657081,177.30936560766514,247.11124558749367]
["430","OH","COLUMBUS",301.14590613382893,311.67548327137547,198.70365016263943,276.92787871747214,301.14590613382893,311.67548327137547,198.70365016263943,276.92787871747214]
["431","OH","COLUMBUS",301.14590613382893,311.67548327137547,198.70365016263943,276.92787871747214,301.14590613382893,311.67548327137547,198.70365016263943,276.92787871747214]
["432","OH","COLUMBUS",301.14590613382893,311.67548327137547,198.70365016263943,276.92787871747214,301.14590613382893,311.67548327137547,198.70365016263943,276.92787871747214]
["433","OH","MARION",287.06228571428579,297.09942857142869,189.41092285714291,263.97685714285723,287.06228571428579,297.09942857142869,189.41092285714291,263.97685714285723]
["434","OH","TOLEDO",307.42424462365591,318.17334408602153,202.84625595430109,282.70131586021506,307.42424462365591,318.17334408602153,202.84625595430109,282.70131586021506]
["435","OH","TOLEDO",307.42424462365591,318.17334408602153,202.84625595430109,282.70131586021506,307.42424462365591,318.17334408602153,202.84625595430109,282.70131586021506]
["436","OH","TOLEDO",307.42424462365591,318.17334408602153,202.84625595430109,282.70131586021506,307.42424462365591,318.17334408602153,202.84625595430109,282.70131586021506]
["437","OH","ZANESVILLE",287.18485714285714,297.22628571428578,189.49179857142857,264.08957142857145,287.18485714285714,297.22628571428578,189.49179857142857,264.08957142857145]
["438","OH","ZANESVILLE",287.18485714285714,297.22628571428578,189.49179857142857,264.08957142857145,287.18485714285714,297.22628571428578,189.49179857142857,264.08957142857145]
["439","OH","STEUBENVILLE",294.22714961346065,304.5148121873579,194.13848043201457,270.56552569349708,294.22714961346065,304.5148121873579,194.13848043201457,270.56552569349708]
["440","OH","LORAIN",296.77469597408617,307.15143359555765,195.81941565478948,272.90819944470161,296.77469597408617,307.15143359555765,195.81941565478948,272.90819944470161]
["441","OH","CLEVELAND",312.11296631205681,323.02600709219865,205.93999256205677,287.01297251773059,312.11296631205681,323.02600709219865,205.93999256205677,287.01297251773059]
["442","OH","AKRON",303.70193601462518,314.32088482632531,200.39018302559413,279.27835374771479,303.70193601462518,314.32088482632531,200.39018302559413,279.27835374771479]
["443","OH","AKRON",303.70193601462518,314.32088482632531,200.39018302559413,279.27835374771479,303.70193601462518,314.32088482632531,200.39018302559413,279.27835374771479]
["444","OH","YOUNGSTOWN",297.08313510986443,307.47065731650309,196.02293156147738,273.19183403459567,297.08313510986443,307.47065731650309,196.02293156147738,273.19183403459567]
["445","OH","YOUNGSTOWN",297.08313510986443,307.47065731650309,196.02293156147738,273.19183403459567,297.08313510986443,307.47065731650309,196.02293156147738,273.19183403459567]
["446","OH","CANTON",294.49504950495049,304.79207920792078,194.31524752475246,270.81188118811883,294.49504950495049,304.79207920792078,194.31524752475246,270.81188118811883]
["447","OH","CANTON",294.49504950495049,304.79207920792078,194.31524752475246,270.81188118811883,294.49504950495049,304.79207920792078,194.31524752475246,270.81188118811883]
["448","OH","MANSFIELD",288.82347793427226,298.92220093896714,190.57300182159625,265.59641502347421,288.82347793427226,298.92220093896714,190.57300182159625,265.59641502347421]
["449","OH","MANSFIELD",288.82347793427226,298.92220093896714,190.57300182159625,265.59641502347421,288.82347793427226,298.92220093896714,190.57300182159625,265.59641502347421]
["450","OH","HAMILTON",282.66264748201445,292.54595683453243,186.50793079136693,259.93103597122308,282.66264748201445,292.54595683453243,186.50793079136693,259.93103597122308]
["451","OH","CINCINNATI",294.48014421252367,304.77665275142311,194.30541263757115,270.79817457305495,294.48014421252367,304.77665275142311,194.30541263757115,270.79817457305495]
["452","OH","CINCINNATI",294.48014421252367,304.77665275142311,194.30541263757115,270.79817457305495,294.48014421252367,304.77665275142311,194.30541263757115,270.79817457305495]
["453","OH","DAYTON",286.41849639942376,296.43312914066246,188.98613445991353,263.38484109457505,286.41849639942376,296.43312914066246,188.98613445991353,263.38484109457505]
["454","OH","DAYTON",286.41849639942376,296.43312914066246,188.98613445991353,263.38484109457505,286.41849639942376,296.43312914066246,188.98613445991353,263.38484109457505]
["455","OH","SPRINGFIELD",288.22688068998559,298.30474365117402,190.17935194058464,265.04779587925253,288.22688068998559,298.30474365117402,190.17935194058464,265.04779587925253]
["456","OH","CHILLICOTHE",291.08580886426597,301.26363434903055,192.06574472299175,267.67681024930755,291.08580886426597,301.26363434903055,192.06574472299175,267.67681024930755]
["457","OH","ATHENS",299.61054511970536,310.08643830570907,197.69058031307554,275.51599079189685,299.61054511970536,310.08643830570907,197.69058031307554,275.51599079189685]
["458","OH","LIMA",289.58367880485531,299.70898225957052,191.07460149393091,266.2954808590103,289.58367880485531,299.70898225957052,191.07460149393091,266.2954808590103]
["460","IN","ANDERSON",288.3489149952245,298.43104489016247,190.25987324737352,265.16001623686731,288.3489149952245,298.43104489016247,190.25987324737352,265.16001623686731]
["461","IN","INDIANAPOLIS",301.52894133949189,312.07191131639718,198.95638643418019,277.28011039260974,301.52894133949189,312.07191131639718,198.95638643418019,277.28011039260974]
["462","IN","INDIANAPOLIS",301.52894133949189,312.07191131639718,198.95638643418019,277.28011039260974,301.52894133949189,312.07191131639718,198.95638643418019,277.28011039260974]
["463","IN","GARY",322.38704347826086,333.65931772575249,212.71908732441477,296.46081270903011,322.38704347826086,333.65931772575249,212.71908732441477,296.46081270903011]
["464","IN","GARY",322.38704347826086,333.65931772575249,212.71908732441477,296.46081270903011,322.38704347826086,333.65931772575249,212.71908732441477,296.46081270903011]
["465","IN","SOUTH BEND",299.73373600746265,310.21393656716413,197.77186476212685,275.62927472014917,299.73373600746265,310.21393656716413,197.77186476212685,275.62927472014917]
["466","IN","SOUTH BEND",299.73373600746265,310.21393656716413,197.77186476212685,275.62927472014917,299.73373600746265,310.21393656716413,197.77186476212685,275.62927472014917]
["467","IN","FORT WAYNE",289.8697127659575,300.00501740812382,191.26333390232108,266.55851208897491,289.8697127659575,300.00501740812382,191.26333390232108,266.55851208897491]
["468","IN","FORT WAYNE",289.8697127659575,300.00501740812382,191.26333390232108,266.55851208897491,289.8697127659575,300.00501740812382,191.26333390232108,266.55851208897491]
["469","IN","KOKOMO",282.26263112391939,292.13195389049002,186.24398992795395,259.56318876080695,282.26263112391939,292.13195389049002,186.24398992795395,259.56318876080695]
["470","IN","LAWRENCEBURG",276.52114285714293,286.18971428571433,182.45561142857147,254.28342857142863,276.52114285714293,286.18971428571433,182.45561142857147,254.28342857142863]
["471","IN","NEW ALBANY",276.73438741396262,286.41041494591946,182.59631555555561,254.47952409046223,276.73438741396262,286.41041494591946,182.59631555555561,254.47952409046223]
["472","IN","COLUMBUS",285.14650501193313,295.11666252983292,188.14684252028636,262.21514272076365,285.14650501193313,295.11666252983292,188.14684252028636,262.21514272076365]
["473","IN","MUNCIE",286.12769334619082,296.13215814850531,188.79425528447442,263.11742430086787,286.12769334619082,296.13215814850531,188.79425528447442,263.11742430086787]
["474","IN","BLOOMINGTON",291.52062176165805,301.71365049458313,192.35264521902968,268.07665567593028,291.52062176165805,301.71365049458313,192.35264521902968,268.07665567593028]
["475","IN","WASHINGTON",286.98491587901708,297.01935349716445,189.35987229206052,263.90570935727794,286.98491587901708,297.01935349716445,189.35987229206052,263.90570935727794]
["476","IN","EVANSVILLE",294.74261414333176,305.0482999525392,194.47859690555293,271.03953678215481,294.74261414333176,305.0482999525392,194.47859690555293,271.03953678215481]
["477","IN","EVANSVILLE",294.74261414333176,305.0482999525392,194.47859690555293,271.03953678215481,294.74261414333176,305.0482999525392,194.47859690555293,271.03953678215481]
["478","IN","TERRE HAUTE",290.187430740038,300.33384440227712,191.47297222011386,266.85067931688809,290.187430740038,300.33384440227712,191.47297222011386,266.85067931688809]
["479","IN","LAFAYETTE",284.77934591194963,294.73666569908073,187.90458170295113,261.87751040154808,284.77934591194963,294.73666569908073,187.90458170295113,261.87751040154808]
["480","MI","ROYAL OAK",291.73239252336458,301.9328258283773,192.49237689889554,{"$f":"K462","v":268.27139592183516},291.73239252336458,301.9328258283773,192.49237689889554,268.27139592183516]
["481","MI","ANN ARBOR",{"$f":"H463","v":314.27314285714283},325.26171428571428,207.36533142857147,288.99942857142861,314.27314285714283,325.26171428571428,207.36533142857147,288.99942857142861]
["482","MI","DETROIT",323.38921495327099,334.69653016142729,213.3803452931181,297.3823899745114,323.38921495327099,334.69653016142729,213.3803452931181,297.3823899745114]
["483","MI","ROYAL OAK",304.00090836653391,314.63031075697216,200.58745250996023,279.55328286852591,304.00090836653391,314.63031075697216,200.58745250996023,279.55328286852591]
["484","MI","FLINT",301.60190682656821,312.14742804428045,199.00453089944648,277.3472080258303,301.60190682656821,312.14742804428045,199.00453089944648,277.3472080258303]
["485","MI","FLINT",301.60190682656821,312.14742804428045,199.00453089944648,277.3472080258303,301.60190682656821,312.14742804428045,199.00453089944648,277.3472080258303]
["486","MI","SAGINAW",296.17891455399069,306.53482065727701,195.42630407511737,272.36033051643193,296.17891455399069,306.53482065727701,195.42630407511737,272.36033051643193]
["487","MI","BAY CITY",293.77297560975597,304.04475797373345,193.83880499061908,270.14787617260782,293.77297560975597,304.04475797373345,193.83880499061908,270.14787617260782]
["488","MI","LANSING",304.63689607390307,315.28853579676678,201.00709321016166,280.13812471131638,304.63689607390307,315.28853579676678,201.00709321016166,280.13812471131638]
["489","MI","LANSING",304.63689607390307,315.28853579676678,201.00709321016166,280.13812471131638,304.63689607390307,315.28853579676678,201.00709321016166,280.13812471131638]
["490","MI","BATTLE CREEK",287.1848571428572,297.22628571428584,189.49179857142863,264.0895714285715,287.1848571428572,297.22628571428584,189.49179857142863,264.0895714285715]
["491","MI","KALAMAZOO",290.55847853352628,300.71786589483844,191.71779889532081,267.19188760250847,290.55847853352628,300.71786589483844,191.71779889532081,267.19188760250847]
["492","MI","JACKSON",293.40366497461929,303.6625343793263,193.5951245362252,269.80826534379327,293.40366497461929,303.6625343793263,193.5951245362252,269.80826534379327]
["493","MI","GRAND RAPIDS",294.92379555134875,305.23581637482249,194.59814495977284,271.20614765735922,294.92379555134875,305.23581637482249,194.59814495977284,271.20614765735922]
["494","MI","MUSKEGON",288.2287512100678,298.30667957405615,190.18058615682483,265.04951597289454,288.2287512100678,298.30667957405615,190.18058615682483,265.04951597289454]
["495","MI","GRAND RAPIDS",294.92379555134875,305.23581637482249,194.59814495977284,271.20614765735922,294.92379555134875,305.23581637482249,194.59814495977284,271.20614765735922]
["496","MI","TRAVERSE CITY",276.93427854330702,286.61729527559044,182.72820875492124,254.66334005905506,276.93427854330702,286.61729527559044,182.72820875492124,254.66334005905506]
["497","MI","GAYLORD",282.87674216867464,292.76753734939751,186.64919585542165,260.12791325301197,282.87674216867464,292.76753734939751,186.64919585542165,260.12791325301197]
["498","MI","IRON MOUNTAIN",286.7206875,296.74588636363643,189.18552775568185,263.66273011363643,286.7206875,296.74588636363643,189.18552775568185,263.66273011363643]
["499","MI","IRON MOUNTAIN",286.7206875,296.74588636363643,189.18552775568185,263.66273011363643,286.7206875,296.74588636363643,189.18552775568185,263.66273011363643]
["500","IA","DES MOINES",304.85215574896932,315.51132203389835,201.14912696289508,280.33607329363269,304.85215574896932,315.51132203389835,201.14912696289508,280.33607329363269]
["501","IA","DES MOINES",304.85215574896932,315.51132203389835,201.14912696289508,280.33607329363269,304.85215574896932,315.51132203389835,201.14912696289508,280.33607329363269]
["502","IA","DES MOINES",304.85215574896932,315.51132203389835,201.14912696289508,280.33607329363269,304.85215574896932,315.51132203389835,201.14912696289508,280.33607329363269]
["503","IA","DES MOINES",304.85215574896932,315.51132203389835,201.14912696289508,280.33607329363269,304.85215574896932,315.51132203389835,201.14912696289508,280.33607329363269]
["504","IA","MASON CITY",271.47683983983978,280.96903703703697,179.12725330830827,249.64478628628623,271.47683983983978,280.96903703703697,179.12725330830827,249.64478628628623]
["505","IA","FORT DODGE",271.23149249249246,280.71511111111107,178.96536695195192,249.4191696696696,271.23149249249246,280.71511111111107,178.96536695195192,249.4191696696696]
["506","IA","WATERLOO",284.91844054580895,294.88062378167643,187.99635984405461,262.00541910331384,284.91844054580895,294.88062378167643,187.99635984405461,262.00541910331384]
["507","IA","WATERLOO",284.91844054580895,294.88062378167643,187.99635984405461,262.00541910331384,284.91844054580895,294.88062378167643,187.99635984405461,262.00541910331384]
["508","IA","CRESTON",284.57842775665392,294.52872243346008,187.77201084600759,261.69274999999993,284.57842775665392,294.52872243346008,187.77201084600759,261.69274999999993]
["509","IA","DES MOINES",304.85215574896932,315.51132203389835,201.14912696289508,280.33607329363269,304.85215574896932,315.51132203389835,201.14912696289508,280.33607329363269]
["510","IA","SIOUX CITY",290.66263799621925,300.82566729678632,191.78652593100188,267.28767060491492,290.66263799621925,300.82566729678632,191.78652593100188,267.28767060491492]
["511","IA","SIOUX CITY",290.66263799621925,300.82566729678632,191.78652593100188,267.28767060491492,290.66263799621925,300.82566729678632,191.78652593100188,267.28767060491492]
["512","IA","SIBLEY",262.37977348643005,271.55389144050099,173.12477991127349,241.27930219206678,262.37977348643005,271.55389144050099,173.12477991127349,241.27930219206678]
["513","IA","SPENCER",264.55473216132367,273.80489762150978,174.55987239917269,243.27935160289556,264.55473216132367,273.80489762150978,174.55987239917269,243.27935160289556]
["514","IA","CARROLL",284.17883285577852,294.11515568290361,187.50834807067815,261.3252903533907,284.17883285577852,294.11515568290361,187.50834807067815,261.3252903533907]
["515","IA","COUNCIL BLUFFS",294.58569559032713,304.88589473684209,194.37505809388333,270.89523755334284,294.58569559032713,304.88589473684209,194.37505809388333,270.89523755334284]
["516","IA","SHENANDOAH",285.05584556720692,295.02283317445188,188.08702313632034,262.13177407054343,285.05584556720692,295.02283317445188,188.08702313632034,262.13177407054343]
["520","IA","DUBUQUE",289.51371428571434,299.63657142857147,191.02843714285717,266.23114285714286,289.51371428571434,299.63657142857147,191.02843714285717,266.23114285714286]
["521","IA","DECORAH",275.7994747774481,285.44281305637986,181.97943666172111,253.61979673590508,275.7994747774481,285.44281305637986,181.97943666172111,253.61979673590508]
["522","IA","CEDAR RAPIDS",299.3194285714286,309.78514285714294,197.49849428571432,275.24828571428571,299.3194285714286,309.78514285714294,197.49849428571432,275.24828571428571]
["523","IA","CEDAR RAPIDS",299.3194285714286,309.78514285714294,197.49849428571432,275.24828571428571,299.3194285714286,309.78514285714294,197.49849428571432,275.24828571428571]
["524","IA","CEDAR RAPIDS",299.3194285714286,309.78514285714294,197.49849428571432,275.24828571428571,299.3194285714286,309.78514285714294,197.49849428571432,275.24828571428571]
["525","IA","OTTUMWA",281.39206863218948,291.23095215079746,185.66957087965201,258.762636539391,281.39206863218948,291.23095215079746,185.66957087965201,258.762636539391]
["526","IA","BURLINGTON",286.86232514177681,296.89247637051028,189.27898383742911,263.79297731568994,286.86232514177681,296.89247637051028,189.27898383742911,263.79297731568994]
["527","IA","DAVENPORT",309.66160536912747,320.48893422818793,204.32252289932879,284.75874899328852,309.66160536912747,320.48893422818793,204.32252289932879,284.75874899328852]
["528","IA","DAVENPORT",309.66160536912747,320.48893422818793,204.32252289932879,284.75874899328852,309.66160536912747,320.48893422818793,204.32252289932879,284.75874899328852]
["530","WI","MILWAUKEE",329.14980497925313,340.65853941908711,217.18132761410791,302.67971576763489,329.14980497925313,340.65853941908711,217.18132761410791,302.67971576763489]
["531","WI","KENOSHA",325.25815239726029,336.63081506849323,214.61351726883566,299.10102825342472,325.25815239726029,336.63081506849323,214.61351726883566,299.10102825342472]
["532","WI","MILWAUKEE",329.14980497925313,340.65853941908711,217.18132761410791,302.67971576763489,329.14980497925313,340.65853941908711,217.18132761410791,302.67971576763489]
["534","WI","RACINE",323.72745064377688,335.04659227467812,213.60352171673824,297.69342489270389,323.72745064377688,335.04659227467812,213.60352171673824,297.69342489270389]
["535","WI","BELOIT",310.59599999999995,321.4559999999999,204.93905999999996,285.61799999999988,310.59599999999995,321.4559999999999,204.93905999999996,285.61799999999988]
["537","WI","MADISON",325.78644328097738,337.17757766143114,214.96209689354279,299.58683420593377,325.78644328097738,337.17757766143114,214.96209689354279,299.58683420593377]
["538","WI","LANCASTER",299.80971428571439,310.29257142857148,197.82199714285719,275.69914285714293,299.80971428571439,310.29257142857148,197.82199714285719,275.69914285714293]
["539","WI","PORTAGE",301.95096508504929,312.50869113697411,199.23484832587295,277.66819516562225,301.95096508504929,312.50869113697411,199.23484832587295,277.66819516562225]
["540","WI","NEW RICHMOND",300.19056716417913,310.68674084124831,198.07329345997283,276.04936770691995,300.19056716417913,310.68674084124831,198.07329345997283,276.04936770691995]
["541","WI","GREEN BAY",324.90513575865134,336.265455190772,214.38058800354932,298.77640106477378,324.90513575865134,336.265455190772,214.38058800354932,298.77640106477378]
["542","WI","GREEN BAY",324.90513575865134,336.265455190772,214.38058800354932,298.77640106477378,324.90513575865134,336.265455190772,214.38058800354932,298.77640106477378]
["543","WI","GREEN BAY",324.90513575865134,336.265455190772,214.38058800354932,298.77640106477378,324.90513575865134,336.265455190772,214.38058800354932,298.77640106477378]
["544","WI","WAUSAU",298.70657142857146,309.15085714285709,197.09411571428575,274.68471428571428,298.70657142857146,309.15085714285709,197.09411571428575,274.68471428571428]
["545","WI","RHINELANDER",303.33265497076025,313.93869185784973,200.1465220962663,278.93877013045432,303.33265497076025,313.93869185784973,200.1465220962663,278.93877013045432]
["546","WI","LA CROSSE",311.50104032623472,322.39268509288627,205.53622839148164,286.45025736293616,311.50104032623472,322.39268509288627,205.53622839148164,286.45025736293616]
["547","WI","EAU CLAIRE",314.81037315436248,325.81772885906048,207.71980950335575,289.4934550335571,314.81037315436248,325.81772885906048,207.71980950335575,289.4934550335571]
["548","WI","SUPERIOR",302.35150493273551,312.92323587443946,199.49913460089687,278.03652376681617,302.35150493273551,312.92323587443946,199.49913460089687,278.03652376681617]
["549","WI","OSHKOSH",301.09648054919899,311.62432951945084,198.67103791762014,276.88242791762008,301.09648054919899,311.62432951945084,198.67103791762014,276.88242791762008]
["550","MN","SAINT PAUL",349.22317373899119,361.43377421937549,230.4262416653323,321.13879263410735,349.22317373899119,361.43377421937549,230.4262416653323,321.13879263410735]
["551","MN","SAINT PAUL",{"$f":"H527","v":349.22317373899119},361.43377421937549,230.4262416653323,321.13879263410735,349.22317373899119,361.43377421937549,230.4262416653323,321.13879263410735]
["553","MN","MINNEAPOLIS",350.35531514432597,362.60550098853315,231.1732570660341,322.17988770264947,350.35531514432597,362.60550098853315,231.1732570660341,322.17988770264947]
["554","MN","MINNEAPOLIS",350.35531514432597,362.60550098853315,231.1732570660341,322.17988770264947,350.35531514432597,362.60550098853315,231.1732570660341,322.17988770264947]
["555","MN","MINNEAPOLIS",350.35531514432597,362.60550098853315,231.1732570660341,322.17988770264947,350.35531514432597,362.60550098853315,231.1732570660341,322.17988770264947]
["556","MN","DULUTH",337.58098360655737,349.38451450189154,222.74443152585118,310.43286254728872,337.58098360655737,349.38451450189154,222.74443152585118,310.43286254728872]
["557","MN","DULUTH",337.58098360655737,349.38451450189154,222.74443152585118,310.43286254728872,337.58098360655737,349.38451450189154,222.74443152585118,310.43286254728872]
["558","MN","DULUTH",337.58098360655737,349.38451450189154,222.74443152585118,310.43286254728872,337.58098360655737,349.38451450189154,222.74443152585118,310.43286254728872]
["559","MN","ROCHESTER",332.06503412969289,343.67569965870308,219.10486919795227,305.36050341296936,332.06503412969289,343.67569965870308,219.10486919795227,305.36050341296936]
["560","MN","MANKATO",318.65382408198133,329.79556618274995,210.25581518360377,293.02781725021356,318.65382408198133,329.79556618274995,210.25581518360377,293.02781725021356]
["561","MN","WINDOM",299.17953909465018,309.64036213991773,197.4061916872428,275.11964609053501,299.17953909465018,309.64036213991773,197.4061916872428,275.11964609053501]
["562","MN","WILLMAR",318.15775344904318,329.28215042278589,209.92849529149976,292.57164040943474,318.15775344904318,329.28215042278589,209.92849529149976,292.57164040943474]
["563","MN","ST. CLOUD",332.65669966996694,344.28805280528047,219.49526501650163,305.90458745874582,332.65669966996694,344.28805280528047,219.49526501650163,305.90458745874582]
["564","MN","BRAINERD",312.12702987697713,323.04056239015807,205.94927205623898,287.02590509666072,312.12702987697713,323.04056239015807,205.94927205623898,287.02590509666072]
["565","MN","DETROIT LAKES",307.31667861945311,318.06201703272069,202.77528119677274,282.60240026893769,307.31667861945311,318.06201703272069,202.77528119677274,282.60240026893769]
["566","MN","BEMIDJI",310.62477669902916,321.48578287731692,204.95804759046783,285.64446248896735,310.62477669902916,321.48578287731692,204.95804759046783,285.64446248896735]
["567","MN","THIEF RIVER FALLS",307.33298232895339,318.07889080199374,202.78603879474409,282.61739284096063,307.33298232895339,318.07889080199374,202.78603879474409,282.61739284096063]
["570","SD","SIOUX FALLS",297.20728517110257,307.59914828897331,196.10484889733837,273.30599999999998,297.20728517110257,307.59914828897331,196.10484889733837,273.30599999999998]
["571","SD","SIOUX FALLS",297.20728517110257,307.59914828897331,196.10484889733837,273.30599999999998,297.20728517110257,307.59914828897331,196.10484889733837,273.30599999999998]
["572","SD","WATERTOWN",272.27658287431143,281.79674311467204,179.65494389584379,250.38021432148221,272.27658287431143,281.79674311467204,179.65494389584379,250.38021432148221]
["573","SD","MITCHELL",262.88462872062661,272.07639895561357,173.45789610443867,241.74355718015664,262.88462872062661,272.07639895561357,173.45789610443867,241.74355718015664]
["574","SD","ABERDEEN",286.74176395061727,296.76769975308639,189.1994345283951,263.68211160493826,286.74176395061727,296.76769975308639,189.1994345283951,263.68211160493826]
["575","SD","PIERRE",294.2198518518519,304.50725925925934,194.13366518518527,270.55881481481487,294.2198518518519,304.50725925925934,194.13366518518527,270.55881481481487]
["576","SD","MOBRIDGE",265.13666286897978,274.40717555670636,174.94384493008803,243.81448368720868,265.13666286897978,274.40717555670636,174.94384493008803,243.81448368720868]
["577","SD","RAPID CITY",280.12134408602151,289.91579667644186,184.83111483382208,257.59410312805477,280.12134408602151,289.91579667644186,184.83111483382208,257.59410312805477]
["580","ND","FARGO",293.49712259276657,303.75925974635982,193.65679022545802,269.89420713950216,293.49712259276657,303.75925974635982,193.65679022545802,269.89420713950216]
["581","ND","FARGO",293.49712259276657,303.75925974635982,193.65679022545802,269.89420713950216,293.49712259276657,303.75925974635982,193.65679022545802,269.89420713950216]
["582","ND","GRAND FORKS",293.30132347328254,303.55661450381677,193.52759703721378,269.71415410305343,293.30132347328254,303.55661450381677,193.52759703721378,269.71415410305343]
["583","ND","DEVILS LAKE",288.80728361045124,298.90544038004754,190.56231639904988,265.58152304038003,288.80728361045124,298.90544038004754,190.56231639904988,265.58152304038003]
["584","ND","JAMESTOWN",287.44385185185189,297.49433618233616,189.66268980056981,264.32773789173785,287.44385185185189,297.49433618233616,189.66268980056981,264.32773789173785]
["585","ND","BISMARCK",304.21333333333331,314.85016317016311,200.72761585081582,279.74862470862467,304.21333333333331,314.85016317016311,200.72761585081582,279.74862470862467]
["586","ND","DICKINSON",287.18485714285714,297.22628571428572,189.49179857142857,264.08957142857145,287.18485714285714,297.22628571428572,189.49179857142857,264.08957142857145]
["587","ND","MINOT",288.1938441805226,298.27055201900242,190.15755361995252,265.017416152019,288.1938441805226,298.27055201900242,190.15755361995252,265.017416152019]
["588","ND","WILLISTON",289.71251055662185,299.84231861804221,191.15960792706332,266.41395201535505,289.71251055662185,299.84231861804221,191.15960792706332,266.41395201535505]
["590","MT","BILLINGS",300.58157524613227,311.09142053445851,198.33129043600567,276.40893108298172,300.58157524613227,311.09142053445851,198.33129043600567,276.40893108298172]
["591","MT","BILLINGS",300.58157524613227,311.09142053445851,198.33129043600567,276.40893108298172,300.58157524613227,311.09142053445851,198.33129043600567,276.40893108298172]
["592","MT","WOLF POINT",293.17634388285313,303.42726499763825,193.44513235710915,269.59922531884746,293.17634388285313,303.42726499763825,193.44513235710915,269.59922531884746]
["593","MT","MILES CITY",289.08542884523234,299.19331097268815,190.74584362721609,265.83729995208432,289.08542884523234,299.19331097268815,190.74584362721609,265.83729995208432]
["594","MT","GREAT FALLS",300.58157524613222,311.09142053445856,198.33129043600565,276.40893108298178,300.58157524613222,311.09142053445856,198.33129043600565,276.40893108298178]
["595","MT","HAVRE",288.64144764649387,298.73380595581187,190.45289365513935,265.42902353506253,288.64144764649387,298.73380595581187,190.45289365513935,265.42902353506253]
["596","MT","HELENA",293.48237837837831,303.74399999999997,193.64706162162162,269.88064864864867,293.48237837837831,303.74399999999997,193.64706162162162,269.88064864864867]
["597","MT","BUTTE",293.69750118315187,303.96664458116425,193.78900506389022,270.07847136772364,293.69750118315187,303.96664458116425,193.78900506389022,270.07847136772364]
["598","MT","MISSOULA",288.51877809798276,298.60684726224792,190.37195319884731,265.31621902017292,288.51877809798276,298.60684726224792,190.37195319884731,265.31621902017292]
["599","MT","KALISPELL",285.42329104116226,295.40312639225186,188.32947291041165,262.46966973365619,285.42329104116226,295.40312639225186,188.32947291041165,262.46966973365619]
["600","IL","NORTH SUBURBAN",353.73351149425287,366.10181609195405,233.40227606321838,325.28641091954023,353.73351149425287,366.10181609195405,233.40227606321838,325.28641091954023]
["601","IL","NORTH SUBURBAN",360.46636017569557,373.07007906295757,237.84477912152272,331.47780673499273,360.46636017569557,373.07007906295757,237.84477912152272,331.47780673499273]
["602","IL","NORTH SUBURBAN",360.46636017569557,373.07007906295757,237.84477912152272,331.47780673499273,360.46636017569557,373.07007906295757,237.84477912152272,331.47780673499273]
["603","IL","NORTH SUBURBAN",360.46636017569557,373.07007906295757,237.84477912152272,331.47780673499273,360.46636017569557,373.07007906295757,237.84477912152272,331.47780673499273]
["604","IL","JOLIET",373.3224294205051,386.3756612184248,246.32753725854377,343.29999628528964,373.3224294205051,386.3756612184248,246.32753725854377,343.29999628528964]
["605","IL","SOUTH SUBURBAN",362.12017715959007,374.7817218155198,238.93600920204983,332.9986244509517,362.12017715959007,374.7817218155198,238.93600920204983,332.9986244509517]
["606","IL","CHICAGO",384.66013793103451,398.10979310344828,253.80844275862069,353.72593103448276,384.66013793103451,398.10979310344828,253.80844275862069,353.72593103448276]
["607","IL","CHICAGO",384.66013793103451,398.10979310344828,253.80844275862069,353.72593103448276,384.66013793103451,398.10979310344828,253.80844275862069,353.72593103448276]
["608","IL","CHICAGO",384.66013793103451,398.10979310344828,253.80844275862069,353.72593103448276,384.66013793103451,398.10979310344828,253.80844275862069,353.72593103448276]
["609","IL","KANKAKEE",343.70842008432356,355.72619701034876,226.78746837102341,316.06753315446537,343.70842008432356,355.72619701034876,226.78746837102341,316.06753315446537]
["610","IL","ROCKFORD",354.34213043478263,366.73171541501978,233.80385816205538,325.84608498023721,354.34213043478263,366.73171541501978,233.80385816205538,325.84608498023721]
["611","IL","ROCKFORD",354.34213043478263,366.73171541501978,233.80385816205538,325.84608498023721,354.34213043478263,366.73171541501978,233.80385816205538,325.84608498023721]
["612","IL","ROCK ISLAND",301.81558381502896,312.36857625611378,199.1455203557137,277.54370120053358,301.81558381502896,312.36857625611378,199.1455203557137,277.54370120053358]
["613","IL","LA SALLE",337.48349605678231,349.28361829652999,222.68010678627761,310.34321490536274,337.48349605678231,349.28361829652999,222.68010678627761,310.34321490536274]
["614","IL","GALESBURG",315.131142857143,326.14971428571437,207.93146142857151,289.78842857142865,315.131142857143,326.14971428571437,207.93146142857151,289.78842857142865]
["615","IL","PEORIA",330.10098360655741,341.64297604035306,217.80893921815891,303.55440100882714,330.10098360655741,341.64297604035306,217.80893921815891,303.55440100882714]
["616","IL","PEORIA",330.10098360655741,341.64297604035306,217.80893921815891,303.55440100882714,330.10098360655741,341.64297604035306,217.80893921815891,303.55440100882714]
["617","IL","BLOOMINGTON",314.51828571428575,325.51542857142863,207.52708285714289,289.22485714285716,314.51828571428575,325.51542857142863,207.52708285714289,289.22485714285716]
["618","IL","CHAMPAIGN",321.68280365296806,332.93045413034446,212.25441215857202,295.81320755500201,321.68280365296806,332.93045413034446,212.25441215857202,295.81320755500201]
["619","IL","CHAMPAIGN",321.68280365296806,332.93045413034446,212.25441215857202,295.81320755500201,321.68280365296806,332.93045413034446,212.25441215857202,295.81320755500201]
["620","IL","EAST ST. LOUIS",324.49265104388581,335.83854793353225,214.10842020451639,{"$f":"K590","v":298.39708819769919},324.49265104388581,335.83854793353225,214.10842020451639,298.39708819769919]
["621","IL","EAST ST. LOUIS",{"$f":"H591","v":324.49265104388581},335.83854793353225,214.10842020451639,298.39708819769919,324.49265104388581,335.83854793353225,214.10842020451639,298.39708819769919]
["622","IL","EAST ST. LOUIS",324.49265104388581,335.83854793353225,214.10842020451639,298.39708819769919,324.49265104388581,335.83854793353225,214.10842020451639,298.39708819769919]
["623","IL","QUINCY",315.68088446559921,326.71867762873211,208.29419478147986,290.29396019039376,315.68088446559921,326.71867762873211,208.29419478147986,290.29396019039376]
["624","IL","EFFINGHAM",318.09820595744679,329.22052085106372,209.88920435744677,292.51688170212765,318.09820595744679,329.22052085106372,209.88920435744677,292.51688170212765]
["625","IL","DECATUR",328.49142857142868,339.97714285714289,216.74691428571433,302.07428571428574,328.49142857142868,339.97714285714289,216.74691428571433,302.07428571428574]
["626","IL","SPRINGFIELD",334.26812758906374,345.95582435791209,220.55852572493782,307.38642502071247,334.26812758906374,345.95582435791209,220.55852572493782,307.38642502071247]
["627","IL","SPRINGFIELD",334.26812758906374,345.95582435791209,220.55852572493782,307.38642502071247,334.26812758906374,345.95582435791209,220.55852572493782,307.38642502071247]
["628","IL","CENTRALIA",315.66638888888889,326.70367521367535,208.28463023504278,290.2806303418804,315.66638888888889,326.70367521367535,208.28463023504278,290.2806303418804]
["629","IL","CARBONDALE",313.25995260663518,324.21309780267126,206.69680299439898,288.06771865575183,313.25995260663518,324.21309780267126,206.69680299439898,288.06771865575183]
["630","MO","ST. LOUIS",328.55492817679544,340.04286272843171,216.78881292392686,302.13267870803224,328.55492817679544,340.04286272843171,216.78881292392686,302.13267870803224]
["631","MO","ST. LOUIS",328.55492817679544,340.04286272843171,216.78881292392686,302.13267870803224,328.55492817679544,340.04286272843171,216.78881292392686,302.13267870803224]
["633","MO","BOWLING GREEN",300.35658549686656,310.85856401074307,198.18283653536258,276.20203491495073,300.35658549686656,310.85856401074307,198.18283653536258,276.20203491495073]
["634","MO","HANNIBAL",293.64830353049064,303.91572673085739,193.75654321412199,270.03323016964691,293.64830353049064,303.91572673085739,193.75654321412199,270.03323016964691]
["635","MO","KIRKSVILLE",292.7571111111111,302.99337373737376,193.16851202020203,269.21370707070707,292.7571111111111,302.99337373737376,193.16851202020203,269.21370707070707]
["636","MO","FLAT RIVER",299.62071799462854,310.09696687555953,197.69729263205016,275.52534556848701,299.62071799462854,310.09696687555953,197.69729263205016,275.52534556848701]
["637","MO","CAPE GIRARDEAU",299.97773000000001,310.46646181818187,197.9328581409091,275.8536468181818,299.97773000000001,310.46646181818187,197.9328581409091,275.8536468181818]
["638","MO","SIKESTON",289.14600000000007,299.25600000000003,190.78581000000005,265.89300000000003,289.14600000000007,299.25600000000003,190.78581000000005,265.89300000000003]
["639","MO","POPLAR BLUFF",288.06668411214946,298.1389457943925,190.07365020560746,264.90048224299062,288.06668411214946,298.1389457943925,190.07365020560746,264.90048224299062]
["640","MO","KANSAS CITY",325.8116405648268,337.20365596919123,214.97872269576385,299.61000513478825,325.8116405648268,337.20365596919123,214.97872269576385,299.61000513478825]
["641","MO","KANSAS CITY",325.8116405648268,337.20365596919123,214.97872269576385,299.61000513478825,325.8116405648268,337.20365596919123,214.97872269576385,299.61000513478825]
["644","MO","ST. JOSEPH",304.02349496797808,314.65368709972557,200.60235571820678,279.57405306495883,304.02349496797808,314.65368709972557,200.60235571820678,279.57405306495883]
["645","MO","ST. JOSEPH",304.02349496797808,314.65368709972557,200.60235571820678,279.57405306495883,304.02349496797808,314.65368709972557,200.60235571820678,279.57405306495883]
["646","MO","CHILLICOTHE",294.6864307974335,304.9901521539872,194.44152571952336,270.9878716773602,294.6864307974335,304.9901521539872,194.44152571952336,270.9878716773602]
["647","MO","HARRISONVILLE",301.60349755011134,312.14907438752778,199.00558049888636,277.34867082405339,301.60349755011134,312.14907438752778,199.00558049888636,277.34867082405339]
["648","MO","JOPLIN",285.83657142857146,295.83085714285704,188.60216571428572,262.84971428571424,285.83657142857146,295.83085714285704,188.60216571428572,262.84971428571424]
["650","MO","JEFFERSON CITY",297.35828571428578,307.75542857142864,196.20448285714286,273.44485714285719,297.35828571428578,307.75542857142864,196.20448285714286,273.44485714285719]
["651","MO","JEFFERSON CITY",297.35828571428578,307.75542857142864,196.20448285714286,273.44485714285719,297.35828571428578,307.75542857142864,196.20448285714286,273.44485714285719]
["652","MO","COLUMBIA",300.88252437902497,311.4028923643055,198.52986425023002,276.68567801287958,300.88252437902497,311.4028923643055,198.52986425023002,276.68567801287958]
["653","MO","SEDALIA",294.35093821510299,304.64292906178486,194.2201592677346,270.67935926773458,294.35093821510299,304.64292906178486,194.2201592677346,270.67935926773458]
["654","MO","ROLLA",302.04745737855183,312.60855728689279,199.29851637030248,277.75692758936754,302.04745737855183,312.60855728689279,199.29851637030248,277.75692758936754]
["655","MO","ROLLA",302.04745737855183,312.60855728689279,199.29851637030248,277.75692758936754,302.04745737855183,312.60855728689279,199.29851637030248,277.75692758936754]
["656","MO","SPRINGFIELD",290.26618960538985,300.41535707410981,191.52493930221371,266.92310442733407,290.26618960538985,300.41535707410981,191.52493930221371,266.92310442733407]
["657","MO","SPRINGFIELD",290.26618960538985,300.41535707410981,191.52493930221371,266.92310442733407,290.26618960538985,300.41535707410981,191.52493930221371,266.92310442733407]
["658","MO","SPRINGFIELD",290.26618960538985,300.41535707410981,191.52493930221371,266.92310442733407,290.26618960538985,300.41535707410981,191.52493930221371,266.92310442733407]
["660","KS","KANSAS CITY",316.81722158841598,327.89474681878011,209.0439786222027,291.33891355857827,316.81722158841598,327.89474681878011,209.0439786222027,291.33891355857827]
["661","KS","KANSAS CITY",316.81722158841598,327.89474681878011,209.0439786222027,291.33891355857827,316.81722158841598,327.89474681878011,209.0439786222027,291.33891355857827]
["662","KS","KANSAS CITY",316.81722158841598,327.89474681878011,209.0439786222027,291.33891355857827,316.81722158841598,327.89474681878011,209.0439786222027,291.33891355857827]
["664","KS","TOPEKA",290.31317800289435,300.46398842257599,191.55594342981189,266.96631403762666,290.31317800289435,300.46398842257599,191.55594342981189,266.96631403762666]
["665","KS","TOPEKA",290.31317800289435,300.46398842257599,191.55594342981189,266.96631403762666,290.31317800289435,300.46398842257599,191.55594342981189,266.96631403762666]
["666","KS","TOPEKA",290.31317800289435,300.46398842257599,191.55594342981189,266.96631403762666,290.31317800289435,300.46398842257599,191.55594342981189,266.96631403762666]
["667","KS","FORT SCOTT",278.48228571428569,288.21942857142858,183.74962285714287,256.08685714285713,278.48228571428569,288.21942857142858,183.74962285714287,256.08685714285713]
["668","KS","EMPORIA",278.17387242394506,287.90023159960754,183.54612400392543,255.8032463199215,278.17387242394506,287.90023159960754,183.54612400392543,255.8032463199215]
["669","KS","BELLEVILLE",275.03278131212733,284.64931212723661,181.47355301192846,252.9147604373758,275.03278131212733,284.64931212723661,181.47355301192846,252.9147604373758]
["670","KS","WICHITA",279.66136650246307,289.43973596059118,184.52761004433498,257.1711167487685,279.66136650246307,289.43973596059118,184.52761004433498,257.1711167487685]
["671","KS","WICHITA",279.66136650246307,289.43973596059118,184.52761004433498,257.1711167487685,279.66136650246307,289.43973596059118,184.52761004433498,257.1711167487685]
["672","KS","WICHITA",279.66136650246307,289.43973596059118,184.52761004433498,257.1711167487685,279.66136650246307,289.43973596059118,184.52761004433498,257.1711167487685]
["673","KS","INDEPENDENCE",278.09489873417721,287.81849659201549,183.49401517526775,255.73062366114894,278.09489873417721,287.81849659201549,183.49401517526775,255.73062366114894]
["674","KS","SALINA",278.57356145526057,288.31389577187809,183.80984888888889,256.17079252704031,278.57356145526057,288.31389577187809,183.80984888888889,256.17079252704031]
["675","KS","HUTCHINSON",265.1219999999999,274.39199999999994,174.93416999999997,243.80099999999999,265.1219999999999,274.39199999999994,174.93416999999997,243.80099999999999]
["676","KS","HAYS",272.44391256830596,281.96992349726776,179.76535224043715,250.53408743169399,272.44391256830596,281.96992349726776,179.76535224043715,250.53408743169399]
["677","KS","COLBY",275.81137297297295,285.45512727272728,181.98728739066337,253.63073808353806,275.81137297297295,285.45512727272728,181.98728739066337,253.63073808353806]
["678","KS","DODGE CITY",282.7571763556424,292.64379091353203,186.57030332193457,260.01796287249635,282.7571763556424,292.64379091353203,186.57030332193457,260.01796287249635]
["679","KS","LIBERAL",271.1730978043912,280.65467465069867,178.92683666666667,249.36547105788424,271.1730978043912,280.65467465069867,178.92683666666667,249.36547105788424]
["680","NE","OMAHA",292.63979763593375,302.87195839243498,193.09110563593381,269.10582789598112,292.63979763593375,302.87195839243498,193.09110563593381,269.10582789598112]
["681","NE","OMAHA",292.63979763593375,302.87195839243498,193.09110563593381,269.10582789598112,292.63979763593375,302.87195839243498,193.09110563593381,269.10582789598112]
["683","NE","LINCOLN",291.5672129277566,301.76187072243346,192.38338724334602,268.11950000000002,291.5672129277566,301.76187072243346,192.38338724334602,268.11950000000002]
["684","NE","LINCOLN",291.5672129277566,301.76187072243346,192.38338724334602,268.11950000000002,291.5672129277566,301.76187072243346,192.38338724334602,268.11950000000002]
["685","NE","LINCOLN",291.5672129277566,301.76187072243346,192.38338724334602,268.11950000000002,291.5672129277566,301.76187072243346,192.38338724334602,268.11950000000002]
["686","NE","COLUMBUS",279.31856195965423,289.08494524495688,184.30141897694529,256.85588040345823,279.31856195965423,289.08494524495688,184.30141897694529,256.85588040345823]
["687","NE","NORFOLK",278.21604255319147,287.94387620889751,183.57394891682782,255.84202514506771,278.21604255319147,287.94387620889751,183.57394891682782,255.84202514506771]
["688","NE","GRAND ISLAND",285.97505813953489,295.97418604651159,188.69354273255814,262.97706395348831,285.97505813953489,295.97418604651159,188.69354273255814,262.97706395348831]
["689","NE","HASTINGS",278.11457142857142,287.83885714285714,183.50699571428572,255.7487142857143,278.11457142857142,287.83885714285714,183.50699571428572,255.7487142857143]
["690","NE","MCCOOK",272.70199502982098,282.23702982107352,179.93564154572559,250.77141500994026,272.70199502982098,282.23702982107352,179.93564154572559,250.77141500994026]
["691","NE","NORTH PLATTE",280.58117092337915,290.39170137524559,185.13452015717093,258.01695088408644,280.58117092337915,290.39170137524559,185.13452015717093,258.01695088408644]
["692","NE","VALENTINE",{"$f":"H655","v":274.48307684630737},284.08038722554886,181.1108441666666,252.40926297405187,274.48307684630737,284.08038722554886,181.1108441666666,252.40926297405187]
["693","NE","ALLIANCE",277.927947188264,287.645707579462,183.38385634229826,255.57709828850858,277.927947188264,287.645707579462,183.38385634229826,255.57709828850858]
["700","LA","NEW ORLEANS",282.22460009985025,292.09259311033452,186.21889610084878,259.52821617573642,282.22460009985025,292.09259311033452,186.21889610084878,259.52821617573642]
["701","LA","NEW ORLEANS",282.22460009985025,292.09259311033452,186.21889610084878,259.52821617573642,282.22460009985025,292.09259311033452,186.21889610084878,259.52821617573642]
["703","LA","THIBODAUX",265.87099180327868,275.16718032786889,175.42837364754101,244.48975819672137,265.87099180327868,275.16718032786889,175.42837364754101,244.48975819672137]
["704","LA","HAMMOND",259.82027877507932,268.90490390707498,171.4359608658923,238.92564097148897,259.82027877507932,268.90490390707498,171.4359608658923,238.92564097148897]
["705","LA","LAFAYETTE",267.15680286738353,276.49794982078856,176.27678415770609,245.67216487455198,267.15680286738353,276.49794982078856,176.27678415770609,245.67216487455198]
["706","LA","LAKE CHARLES",270.28532924961712,279.73586523736594,178.34106462480858,248.54909647779479,270.28532924961712,279.73586523736594,178.34106462480858,248.54909647779479]
["707","LA","BATON ROUGE",274.68257142857146,284.28685714285717,181.24247571428575,252.59271428571435,274.68257142857146,284.28685714285717,181.24247571428575,252.59271428571435]
["708","LA","BATON ROUGE",274.68257142857146,284.28685714285717,181.24247571428575,252.59271428571435,274.68257142857146,284.28685714285717,181.24247571428575,252.59271428571435]
["710","LA","SHREVEPORT",272.07865406234026,281.59189371486968,179.52434548288196,250.19820286152273,272.07865406234026,281.59189371486968,179.52434548288196,250.19820286152273]
["711","LA","SHREVEPORT",272.07865406234026,281.59189371486968,179.52434548288196,250.19820286152273,272.07865406234026,281.59189371486968,179.52434548288196,250.19820286152273]
["712","LA","MONROE",265.06089525794681,274.3287587285044,174.8938515528921,243.74480927566438,265.06089525794681,274.3287587285044,174.8938515528921,243.74480927566438]
["713","LA","ALEXANDRIA",265.42753026383861,274.70821314019662,175.13576655975169,244.08195964821519,265.42753026383861,274.70821314019662,175.13576655975169,244.08195964821519]
["714","LA","ALEXANDRIA",265.42753026383861,274.70821314019662,175.13576655975169,244.08195964821519,265.42753026383861,274.70821314019662,175.13576655975169,244.08195964821519]
["716","AR","PINE BLUFF",266.53345188284521,275.85280334728037,175.86548148535567,245.09894351464439,266.53345188284521,275.85280334728037,175.86548148535567,245.09894351464439]
["717","AR","CAMDEN",262.30285714285719,271.47428571428577,173.07402857142861,241.20857142857147,262.30285714285719,271.47428571428577,173.07402857142861,241.20857142857147]
["718","AR","TEXARKANA",264.03547151898738,273.26748101265827,174.21725115506334,242.80184968354433,264.03547151898738,273.26748101265827,174.21725115506334,242.80184968354433]
["719","AR","HOT SPRINGS",259.94323264440914,269.03215686274513,171.51708892421837,239.03870694223639,259.94323264440914,269.03215686274513,171.51708892421837,239.03870694223639]
["720","AR","LITTLE ROCK",265.33691070496081,274.61442506527419,175.07597349347262,243.99862767624023,265.33691070496081,274.61442506527419,175.07597349347262,243.99862767624023]
["721","AR","LITTLE ROCK",265.33691070496081,274.61442506527419,175.07597349347262,243.99862767624023,265.33691070496081,274.61442506527419,175.07597349347262,243.99862767624023]
["722","AR","LITTLE ROCK",265.33691070496081,274.61442506527419,175.07597349347262,243.99862767624023,265.33691070496081,274.61442506527419,175.07597349347262,243.99862767624023]
["723","AR","WEST MEMPHIS",264.81359175257728,274.07280824742264,174.73067447422676,243.51739381443298,264.81359175257728,274.07280824742264,174.73067447422676,243.51739381443298]
["724","AR","JONESBORO",264.29445093945719,273.53551565762001,174.38813229645095,243.04000208768264,264.29445093945719,273.53551565762001,174.38813229645095,243.04000208768264]
["725","AR","BATESVILLE",255.4226286329386,264.3534897739504,168.53428059203441,234.88164800861139,255.4226286329386,264.3534897739504,168.53428059203441,234.88164800861139]
["726","AR","HARRISON",257.16988329764445,266.16183725910059,169.6871632066381,236.48838918629545,257.16988329764445,266.16183725910059,169.6871632066381,236.48838918629545]
["727","AR","FAYETTEVILLE",255.20924309691395,264.13264320519767,168.39348344342179,234.68542284786145,255.20924309691395,264.13264320519767,168.39348344342179,234.68542284786145]
["728","AR","RUSSELLVILLE",254.59553398058259,263.49747572815539,167.98854271844667,234.1210679611651,254.59553398058259,263.49747572815539,167.98854271844667,234.1210679611651]
["729","AR","FORT SMITH",261.90541276595752,271.06294468085116,172.81178476595753,240.8430893617022,261.90541276595752,271.06294468085116,172.81178476595753,240.8430893617022]
["730","OK","OKLAHOMA CITY",275.68022706538272,285.31939584389266,181.90075401926006,253.51013887481,275.68022706538272,285.31939584389266,181.90075401926006,253.51013887481]
["731","OK","OKLAHOMA CITY",275.68022706538272,285.31939584389266,181.90075401926006,253.51013887481,275.68022706538272,285.31939584389266,181.90075401926006,253.51013887481]
["734","OK","ARDMORE",266.39378723404252,275.70825531914886,175.77332723404254,244.97051063829784,266.39378723404252,275.70825531914886,175.77332723404254,244.97051063829784]
["735","OK","LAWTON",274.1630781808891,283.74919979560553,180.89970099131324,252.1149984670414,274.1630781808891,283.74919979560553,180.89970099131324,252.1149984670414]
["736","OK","CLINTON",268.52353062274841,277.91246525990738,177.17858553782813,246.92898095728259,268.52353062274841,277.91246525990738,177.17858553782813,246.92898095728259]
["737","OK","ENID",271.17422813299231,280.65584450127881,178.92758248593353,249.36651048593353,271.17422813299231,280.65584450127881,178.92758248593353,249.36651048593353]
["738","OK","WOODWARD",267.9124934245134,277.28006312467124,176.77540781167812,246.36708311415049,267.9124934245134,277.28006312467124,176.77540781167812,246.36708311415049]
["739","OK","GUYMON",262.60776341844706,271.7898530484627,173.275213408025,241.48895726941112,262.60776341844706,271.7898530484627,173.275213408025,241.48895726941112]
["740","OK","TULSA",270.46859060402687,279.9255343314403,178.46198508002061,248.7176200309757,270.46859060402687,279.9255343314403,178.46198508002061,248.7176200309757]
["741","OK","TULSA",270.46859060402687,279.9255343314403,178.46198508002061,248.7176200309757,270.46859060402687,279.9255343314403,178.46198508002061,248.7176200309757]
["743","OK","MIAMI",259.68300105932207,268.7628262711865,171.34538157309325,238.79940307203393,259.68300105932207,268.7628262711865,171.34538157309325,238.79940307203393]
["744","OK","MUSKOGEE",269.9022857142856,279.33942857142853,178.08832285714286,248.19685714285708,269.9022857142856,279.33942857142853,178.08832285714286,248.19685714285708]
["745","OK","MCALESTER",259.47377245508994,268.54628198149163,171.20732727272733,238.60700054436589,259.47377245508994,268.54628198149163,171.20732727272733,238.60700054436589]
["746","OK","PONCA CITY",257.78204250797029,266.79540063761959,170.09108126461211,237.05131880977686,257.78204250797029,266.79540063761959,170.09108126461211,237.05131880977686]
["747","OK","DURANT",258.91646511627914,267.96948837209311,170.83960186046517,238.09451162790705,258.91646511627914,267.96948837209311,170.83960186046517,238.09451162790705]
["748","OK","SHAWNEE",262.96152639832718,272.15598536330367,173.50863512807106,241.81427077888131,262.96152639832718,272.15598536330367,173.50863512807106,241.81427077888131]
["749","OK","POTEAU",258.85511442256518,267.9059925492283,170.79912112825971,238.03809473123999,258.85511442256518,267.9059925492283,170.79912112825971,238.03809473123999]
["750","TX","MCKINNEY",270.01208268733842,279.45306459948313,178.16076966408264,248.29782428940561,270.01208268733842,279.45306459948313,178.16076966408264,248.29782428940561]
["751","TX","WAXAHACKIE",270.25743669250642,279.70699741602061,178.32266041343664,248.52344702842373,270.25743669250642,279.70699741602061,178.32266041343664,248.52344702842373]
["752","TX","DALLAS",282.47988961364774,292.35680883090816,186.3873425489212,259.76297541394877,282.47988961364774,292.35680883090816,186.3873425489212,259.76297541394877]
["753","TX","DALLAS",282.47988961364774,292.35680883090816,186.3873425489212,259.76297541394877,282.47988961364774,292.35680883090816,186.3873425489212,259.76297541394877]
["754","TX","GREENVILLE",269.73737681159412,279.16875362318831,177.97951181159416,248.04521014492747,269.73737681159412,279.16875362318831,177.97951181159416,248.04521014492747]
["755","TX","TEXARKANA",270.60931697127933,280.0711812010444,178.55483987989555,248.84702924281979,270.60931697127933,280.0711812010444,178.55483987989555,248.84702924281979]
["756","TX","LONGVIEW",265.70475300261091,274.99512898172321,175.3186851018277,244.33688825065266,265.70475300261091,274.99512898172321,175.3186851018277,244.33688825065266]
["757","TX","TYLER",270.07156616502334,279.51462791904515,178.20001836014532,248.35252413077322,270.07156616502334,279.51462791904515,178.20001836014532,248.35252413077322]
["758","TX","PALESTINE",259.96096514745312,269.05050938337803,171.52878927613943,239.05501340482576,259.96096514745312,269.05050938337803,171.52878927613943,239.05501340482576]
["759","TX","LUFKIN",263.08462790697678,272.28339112050742,173.58986060253702,241.92747251585627,263.08462790697678,272.28339112050742,173.58986060253702,241.92747251585627]
["760","TX","FORT WORTH",274.19228571428567,283.77942857142853,180.91897285714282,252.14185714285705,274.19228571428567,283.77942857142853,180.91897285714282,252.14185714285705]
["761","TX","FORT WORTH",274.19228571428567,283.77942857142853,180.91897285714282,252.14185714285705,274.19228571428567,283.77942857142853,180.91897285714282,252.14185714285705]
["762","TX","DENTON",266.77741433021799,276.10529595015572,176.0264540498442,245.3232866043613,266.77741433021799,276.10529595015572,176.0264540498442,245.3232866043613]
["763","TX","WICHITA FALLS",267.20571428571435,276.54857142857145,176.30905714285717,245.71714285714287,267.20571428571435,276.54857142857145,176.30905714285717,245.71714285714287]
["764","TX","EASTLAND",258.82446451612907,267.87427096774195,170.77889754838708,238.00990967741936,258.82446451612907,267.87427096774195,170.77889754838708,238.00990967741936]
["765","TX","TEMPLE",252.58978536048429,261.42159603742431,166.66509928453493,232.27662080352226,252.58978536048429,261.42159603742431,166.66509928453493,232.27662080352226]
["766","TX","WACO",268.69669606801273,278.09168544102016,177.29284445802335,247.0882205100956,268.69669606801273,278.09168544102016,177.29284445802335,247.0882205100956]
["767","TX","WACO",268.69669606801273,278.09168544102016,177.29284445802335,{"$f":"K718","v":247.0882205100956},268.69669606801273,278.09168544102016,177.29284445802335,247.0882205100956]
["768","TX","BROWNWOOD",{"$f":"H719","v":261.52124788135603},270.66534745762721,172.55830310381359,240.48981885593224,261.52124788135603,270.66534745762721,172.55830310381359,240.48981885593224]
["769","TX","SAN ANGELO",265.12200000000007,274.39200000000005,174.93416999999999,243.80099999999999,265.12200000000007,274.39200000000005,174.93416999999999,243.80099999999999]
["770","TX","HOUSTON",279.95314285714284,289.74171428571429,184.72013142857145,257.43942857142855,279.95314285714284,289.74171428571429,184.72013142857145,257.43942857142855]
["771","TX","HOUSTON",279.95314285714284,289.74171428571429,184.72013142857145,257.43942857142855,279.95314285714284,289.74171428571429,184.72013142857145,257.43942857142855]
["772","TX","HOUSTON",279.95314285714284,289.74171428571429,184.72013142857145,257.43942857142855,279.95314285714284,289.74171428571429,184.72013142857145,257.43942857142855]
["773","TX","HUNTSVILLE",262.71568057702211,271.90154353426061,173.34641986604842,241.58819577537349,262.71568057702211,271.90154353426061,173.34641986604842,241.58819577537349]
["774","TX","WHARTON",266.45037563451768,275.76682233502532,175.81066568527916,245.02254822335024,266.45037563451768,275.76682233502532,175.81066568527916,245.02254822335024]
["775","TX","GALVESTON",266.19289816700609,275.50034215885944,175.64077557026476,244.78577698574338,266.19289816700609,275.50034215885944,175.64077557026476,244.78577698574338]
["776","TX","BEAUMONT",271.60437423312874,281.10103067484658,179.2114037116564,249.76206441717784,271.60437423312874,281.10103067484658,179.2114037116564,249.76206441717784]
["777","TX","BEAUMONT",271.60437423312874,281.10103067484658,179.2114037116564,249.76206441717784,271.60437423312874,281.10103067484658,179.2114037116564,249.76206441717784]
["778","TX","BRYAN",259.16115002613697,268.22272869837957,171.0010511238892,238.3195190799791,259.16115002613697,268.22272869837957,171.0010511238892,238.3195190799791]
["779","TX","VICTORIA",265.22522903885482,274.49883844580773,175.0022831186094,243.89592740286295,265.22522903885482,274.49883844580773,175.0022831186094,243.89592740286295]
["780","TX","LAREDO",267.37521011058453,276.72399368088475,176.42089475513433,245.8730078988942,267.37521011058453,276.72399368088475,176.42089475513433,245.8730078988942]
["781","TX","SAN ANTONIO",274.79648578811367,284.40475452196381,181.31763927648583,252.69746770025836,274.79648578811367,284.40475452196381,181.31763927648583,252.69746770025836]
["782","TX","SAN ANTONIO",274.79648578811367,284.40475452196381,181.31763927648583,252.69746770025836,274.79648578811367,284.40475452196381,181.31763927648583,252.69746770025836]
["783","TX","CORPUS CHRISTI",273.96586377708979,283.54508978328175,180.76957396284828,251.93364396284832,273.96586377708979,283.54508978328175,180.76957396284828,251.93364396284832]
["784","TX","CORPUS CHRISTI",273.96586377708979,283.54508978328175,180.76957396284828,251.93364396284832,273.96586377708979,283.54508978328175,180.76957396284828,251.93364396284832]
["785","TX","MCALLEN",262.28758947368419,271.45848421052625,173.06395457894737,241.19453157894736,262.28758947368419,271.45848421052625,173.06395457894737,241.19453157894736]
["786","TX","AUSTIN",271.66561421850497,281.16441191845274,179.25181139571356,249.81837950862521,271.66561421850497,281.16441191845274,179.25181139571356,249.81837950862521]
["787","TX","AUSTIN",271.66561421850497,281.16441191845274,179.25181139571356,249.81837950862521,271.66561421850497,281.16441191845274,179.25181139571356,249.81837950862521]
["788","TX","DEL RIO",264.53685906040266,273.78639958699017,174.5480792772328,243.26291584925141,264.53685906040266,273.78639958699017,174.5480792772328,243.26291584925141]
["789","TX","GIDDINGS",259.37580730545272,268.44489147697203,171.14268740074118,238.51691371095822,259.37580730545272,268.44489147697203,171.14268740074118,238.51691371095822]
["790","TX","AMARILLO",273.40154351224589,282.96103804064609,180.39722124544031,251.41470609692541,273.40154351224589,282.96103804064609,180.39722124544031,251.41470609692541]
["791","TX","AMARILLO",273.40154351224589,282.96103804064609,180.39722124544031,251.41470609692541,273.40154351224589,282.96103804064609,180.39722124544031,251.41470609692541]
["792","TX","CHILDRESS",264.77026492146598,274.02796649214662,174.7020863403142,243.47755130890053,264.77026492146598,274.02796649214662,174.7020863403142,243.47755130890053]
["793","TX","LUBBOCK",273.7361797752809,283.30737487231869,180.61802267620021,251.72243105209395,273.7361797752809,283.30737487231869,180.61802267620021,251.72243105209395]
["794","TX","LUBBOCK",273.7361797752809,283.30737487231869,180.61802267620021,251.72243105209395,273.7361797752809,283.30737487231869,180.61802267620021,251.72243105209395]
["795","TX","ABILENE",270.16520270270269,279.61153846153849,178.26180210498961,248.43863045738047,270.16520270270269,279.61153846153849,178.26180210498961,248.43863045738047]
["796","TX","ABILENE",270.16520270270269,279.61153846153849,178.26180210498961,248.43863045738047,270.16520270270269,279.61153846153849,178.26180210498961,248.43863045738047]
["797","TX","MIDLAND",277.10579458354624,286.79480838017372,182.84137935615732,254.82106285130297,277.10579458354624,286.79480838017372,182.84137935615732,254.82106285130297]
["798","TX","EL PASO",273.05320646506772,282.60052137643379,180.1673796923879,251.09438216892596,273.05320646506772,282.60052137643379,180.1673796923879,251.09438216892596]
["799","TX","EL PASO",273.05320646506772,282.60052137643379,180.1673796923879,251.09438216892596,273.05320646506772,282.60052137643379,180.1673796923879,251.09438216892596]
["800","CO","DENVER",300.563813822285,311.07303808180541,198.31957100141048,276.39259802538788,300.563813822285,311.07303808180541,198.31957100141048,276.39259802538788]
["801","CO","DENVER",300.563813822285,311.07303808180541,198.31957100141048,276.39259802538788,300.563813822285,311.07303808180541,198.31957100141048,276.39259802538788]
["802","CO","DENVER",300.563813822285,311.07303808180541,198.31957100141048,276.39259802538788,300.563813822285,311.07303808180541,198.31957100141048,276.39259802538788]
["803","CO","BOULDER",287.52261478975356,297.57585306911557,189.71465956984053,264.40016674722091,287.52261478975356,297.57585306911557,189.71465956984053,264.40016674722091]
["804","CO","GOLDEN",285.10114285714297,295.06971428571433,188.11691142857143,262.17342857142859,285.10114285714297,295.06971428571433,188.11691142857143,262.17342857142859]
["805","CO","FORT COLLINS",289.7742734635541,299.90624106717485,191.2003606479276,266.47074797522629,289.7742734635541,299.90624106717485,191.2003606479276,266.47074797522629]
["806","CO","GREELEY",284.65691067961166,294.6099495145632,187.82379585436897,261.76492135922331,284.65691067961166,294.6099495145632,187.82379585436897,261.76492135922331]
["807","CO","FORT MORGAN",282.01959049005342,291.88041533236293,186.08362559922369,259.33969335274139,282.01959049005342,291.88041533236293,186.08362559922369,259.33969335274139]
["808","CO","COLORADO SPRINGS",285.97459005311435,295.97370159343313,188.69323387735392,262.97663351038148,285.97459005311435,295.97370159343313,188.69323387735392,262.97663351038148]
["809","CO","COLORADO SPRINGS",285.97459005311435,295.97370159343313,188.69323387735392,262.97663351038148,285.97459005311435,295.97370159343313,188.69323387735392,262.97663351038148]
["810","CO","PUEBLO",287.15509602327842,297.19548399612023,189.47216143549952,264.06220368574196,287.15509602327842,297.19548399612023,189.47216143549952,264.06220368574196]
["811","CO","ALAMOSA",286.40361132437619,296.41772360844533,188.97631291266794,263.37115307101726,286.40361132437619,296.41772360844533,188.97631291266794,263.37115307101726]
["812","CO","SALIDA",286.4789539347409,296.4957005758157,189.02602586372359,263.44043666026863,286.4789539347409,296.4957005758157,189.02602586372359,263.44043666026863]
["813","CO","DURANGO",282.54280176211449,292.42192070484572,186.42885356828191,259.82082819383254,282.54280176211449,292.42192070484572,186.42885356828191,259.82082819383254]
["814","CO","MONTROSE",280.41305278737042,290.21770498273298,185.0235915786877,257.86235273803646,280.41305278737042,290.21770498273298,185.0235915786877,257.86235273803646]
["815","CO","GRAND JUNCTION",293.7436359338061,304.01439243498811,193.81944593380615,270.12089598108747,293.7436359338061,304.01439243498811,193.81944593380615,270.12089598108747]
["816","CO","GLENWOOD SPRINGS",283.56927875243667,293.48428849902535,187.1061489278753,260.7647563352827,283.56927875243667,293.48428849902535,187.1061489278753,260.7647563352827]
["820","WY","CHEYENNE",290.05060945033762,300.19223915139838,191.38269408871753,266.7248611378979,290.05060945033762,300.19223915139838,191.38269408871753,266.7248611378979]
["821","WY","YELLOWSTONE NAT'L PA",283.30887886218727,293.21478371750857,186.93433052476703,260.52529769494845,283.30887886218727,293.21478371750857,186.93433052476703,260.52529769494845]
["822","WY","WHEATLAND",282.91310856573705,292.80517529880473,186.67319131972113,260.1613550796813,282.91310856573705,292.80517529880473,186.67319131972113,260.1613550796813]
["823","WY","RAWLINS",287.47619575699139,297.52781099324983,189.68403112343307,264.357480713597,287.47619575699139,297.52781099324983,189.68403112343307,264.357480713597]
["824","WY","WORLAND",284.50538310412571,294.45312377210217,187.7238141453831,261.62557956777994,284.50538310412571,294.45312377210217,187.7238141453831,261.62557956777994]
["825","WY","RIVERTON",285.90156868537673,295.89812703101921,188.64505254062044,262.90948449039888,285.90156868537673,295.89812703101921,188.64505254062044,262.90948449039888]
["826","WY","CASPER",292.10805286343623,302.32162114537454,192.74024704845817,268.61684581497798,292.10805286343623,302.32162114537454,192.74024704845817,268.61684581497798]
["827","WY","NEWCASTLE",283.57054367026501,293.48559764474976,187.10698355250247,260.76591952894995,283.57054367026501,293.48559764474976,187.10698355250247,260.76591952894995]
["828","WY","SHERIDAN",289.8697127659575,300.00501740812376,191.26333390232111,266.55851208897485,289.8697127659575,300.00501740812376,191.26333390232111,266.55851208897485]
["829","WY","ROCK SPRINGS",292.08771428571441,302.30057142857146,192.72682714285716,268.59814285714288,292.08771428571441,302.30057142857146,192.72682714285716,268.59814285714288]
["830","WY","ROCK SPRINGS",292.08771428571441,302.30057142857146,192.72682714285716,268.59814285714288,292.08771428571441,302.30057142857146,192.72682714285716,268.59814285714288]
["831","WY","ROCK SPRINGS",292.08771428571441,302.30057142857146,192.72682714285716,268.59814285714288,292.08771428571441,302.30057142857146,192.72682714285716,268.59814285714288]
["832","ID","POCATELLO",301.08238465138038,311.60974075807206,198.66173708937762,276.86946560598972,301.08238465138038,311.60974075807206,198.66173708937762,276.86946560598972]
["833","ID","TWIN FALLS",300.34684136640158,310.84847917641565,198.17640711277497,276.19307440336928,300.34684136640158,310.84847917641565,198.17640711277497,276.19307440336928]
["834","ID","IDAHO FALLS",298.57218958235569,309.01177663068984,197.00544718911308,274.56113937118727,298.57218958235569,309.01177663068984,197.00544718911308,274.56113937118727]
["835","ID","LEWISTON",{"$f":"H783","v":317.43054401408449},328.52951408450701,209.44866419894367,291.90291285211271,317.43054401408449,328.52951408450701,209.44866419894367,291.90291285211271]
["836","ID","BOISE",300.04342937324606,310.53445837231072,197.97620824134714,275.91406267539764,300.04342937324606,310.53445837231072,197.97620824134714,275.91406267539764]
["837","ID","BOISE",300.04342937324606,310.53445837231072,197.97620824134714,275.91406267539764,300.04342937324606,310.53445837231072,197.97620824134714,275.91406267539764]
["838","ID","COEUR D'ALENE",316.81722158841603,327.89474681878016,209.0439786222027,291.33891355857838,316.81722158841603,327.89474681878016,209.0439786222027,291.33891355857838]
["840","UT","SALT LAKE CITY",295.8116036036036,306.15466666666674,195.18394306306311,272.02255855855856,295.8116036036036,306.15466666666674,195.18394306306311,272.02255855855856]
["841","UT","SALT LAKE CITY",295.8116036036036,306.15466666666674,195.18394306306311,272.02255855855856,295.8116036036036,306.15466666666674,195.18394306306311,272.02255855855856]
["842","UT","OGDEN",283.2982303614458,293.20376289156621,186.92730437590365,260.51550554216863,283.2982303614458,293.20376289156621,186.92730437590365,260.51550554216863]
["843","UT","LOGAN",294.31187499999999,304.60249999999996,194.19438437500003,270.64343749999995,294.31187499999999,304.60249999999996,194.19438437500003,270.64343749999995]
["844","UT","OGDEN",283.2982303614458,293.20376289156621,186.92730437590365,260.51550554216863,283.2982303614458,293.20376289156621,186.92730437590365,260.51550554216863]
["845","UT","PRICE",281.73013887530573,291.58084303178492,185.89263813691937,259.07351931540353,281.73013887530573,291.58084303178492,185.89263813691937,259.07351931540353]
["846","UT","PROVO",290.23693493975895,300.38507951807225,191.50563633734939,266.89620240963853,290.23693493975895,300.38507951807225,191.50563633734939,266.89620240963853]
["847","UT","PROVO",290.23693493975895,300.38507951807225,191.50563633734939,266.89620240963853,290.23693493975895,300.38507951807225,191.50563633734939,266.89620240963853]
["850","AZ","PHOENIX",290.43838435207823,300.5935726161369,191.63855773105138,267.0814513447433,290.43838435207823,300.5935726161369,191.63855773105138,267.0814513447433]
["851","AZ","MESA/TEMPE",281.11878260869565,290.94811067193672,185.48924988142292,258.51132806324108,281.11878260869565,290.94811067193672,185.48924988142292,258.51132806324108]
["852","AZ","MESA/TEMPE",281.11878260869565,290.94811067193672,185.48924988142292,258.51132806324108,281.11878260869565,290.94811067193672,185.48924988142292,258.51132806324108]
["853","AZ","PHOENIX",290.43838435207823,300.5935726161369,191.63855773105138,267.0814513447433,290.43838435207823,300.5935726161369,191.63855773105138,267.0814513447433]
["855","AZ","GLOBE",279.95314285714284,289.74171428571429,184.72013142857145,257.43942857142861,279.95314285714284,289.74171428571429,184.72013142857145,257.43942857142861]
["856","AZ","TUCSON",281.73464529058117,291.58550701402811,185.89561158316639,259.07766332665335,281.73464529058117,291.58550701402811,185.89561158316639,259.07766332665335]
["857","AZ","TUCSON",281.73464529058117,291.58550701402811,185.89561158316639,259.07766332665335,281.73464529058117,291.58550701402811,185.89561158316639,259.07766332665335]
["859","AZ","SHOW LOW",280.79600983767835,290.6140521396951,185.27627628135767,258.21451254303992,280.79600983767835,290.6140521396951,185.27627628135767,258.21451254303992]
["860","AZ","FLAGSTAFF",289.67169655841013,299.8000775569559,191.132677823558,266.37642026175479,289.67169655841013,299.8000775569559,191.132677823558,266.37642026175479]
["863","AZ","PRESCOTT",283.69319528949961,293.61253778213944,187.18791217860652,260.87870755642791,283.69319528949961,293.61253778213944,187.18791217860652,260.87870755642791]
["864","AZ","KINGMAN",278.62097211155378,288.36296414342621,183.84113163346615,256.21439043824699,278.62097211155378,288.36296414342621,183.84113163346615,256.21439043824699]
["865","AZ","CHAMBERS",280.09159643916911,289.88500890207723,184.8114865875371,257.56674777448069,280.09159643916911,289.88500890207723,184.8114865875371,257.56674777448069]
["870","NM","ALBUQUERQUE",282.5437555446033,292.42290783637264,186.42948289797931,259.82170527353378,282.5437555446033,292.42290783637264,186.42948289797931,259.82170527353378]
["871","NM","ALBUQUERQUE",282.5437555446033,292.42290783637264,186.42948289797931,259.82170527353378,282.5437555446033,292.42290783637264,186.42948289797931,259.82170527353378]
["872","NM","ALBUQUERQUE",282.5437555446033,292.42290783637264,186.42948289797931,259.82170527353378,282.5437555446033,292.42290783637264,186.42948289797931,259.82170527353378]
["873","NM","GALLUP",281.76146312684369,291.61326253687315,185.91330666666667,259.10232448377582,281.76146312684369,291.61326253687315,185.91330666666667,259.10232448377582]
["874","NM","FARMINGTON",282.68211891891883,292.56610909090904,186.5207785356265,259.94894152334143,282.68211891891883,292.56610909090904,186.5207785356265,259.94894152334143]
["875","NM","SANTA FE",286.12848258950459,296.13297498773909,188.79477604708191,263.1181500735654,286.12848258950459,296.13297498773909,188.79477604708191,263.1181500735654]
["877","NM","LAS VEGAS",278.77362904027848,288.52095872700147,183.94185851815016,256.35477076081548,278.77362904027848,288.52095872700147,183.94185851815016,256.35477076081548]
["878","NM","SOCORRO",278.45222333000999,288.18831505483547,183.72978693918245,256.0592123629113,278.45222333000999,288.18831505483547,183.72978693918245,256.0592123629113]
["879","NM","TRUTH/CONSEQUENCES",274.47037119675457,284.06723732251521,181.10246065922922,252.39757910750507,274.47037119675457,284.06723732251521,181.10246065922922,252.39757910750507]
["880","NM","LAS CRUCES",277.10381190595297,286.79275637818904,182.84007113556774,254.81923961980988,277.10381190595297,286.79275637818904,182.84007113556774,254.81923961980988]
["881","NM","CLOVIS",282.61942675159236,292.50122488975995,186.47941266536012,259.89129103380697,282.61942675159236,292.50122488975995,186.47941266536012,259.89129103380697]
["882","NM","ROSWELL",286.23636936500242,296.24463402811426,188.86596245758599,263.21736063984486,286.23636936500242,296.24463402811426,188.86596245758599,263.21736063984486]
["883","NM","CARRIZOZO",286.63367004341535,296.6558263386396,189.12811144717801,263.58271056439941,286.63367004341535,296.6558263386396,189.12811144717801,263.58271056439941]
["884","NM","TUCUMCARI",283.76864195121954,293.69062243902448,187.23769378536591,260.94808682926833,283.76864195121954,293.69062243902448,187.23769378536591,260.94808682926833]
["885","TX","EL PASO",273.05320646506772,282.60052137643379,180.1673796923879,251.09438216892596,273.05320646506772,282.60052137643379,180.1673796923879,251.09438216892596]
["889","NV","LAS VEGAS",343.46236074918562,355.4715342019544,226.62511222719868,315.8412618078176,343.46236074918562,355.4715342019544,226.62511222719868,315.8412618078176]
["890","NV","LAS VEGAS",343.46236074918562,355.4715342019544,226.62511222719868,315.8412618078176,343.46236074918562,355.4715342019544,226.62511222719868,315.8412618078176]
["891","NV","LAS VEGAS",343.46236074918562,355.4715342019544,226.62511222719868,315.8412618078176,343.46236074918562,355.4715342019544,226.62511222719868,315.8412618078176]
["893","NV","ELY",312.0927457627119,323.00507953063891,205.92665053455025,286.99437809647986,312.0927457627119,323.00507953063891,205.92665053455025,286.99437809647986]
["894","NV","RENO",309.07822040072853,319.88515118397078,203.93759081056464,284.2222795992713,309.07822040072853,319.88515118397078,203.93759081056464,284.2222795992713]
["895","NV","RENO",309.07822040072853,319.88515118397078,203.93759081056464,284.2222795992713,309.07822040072853,319.88515118397078,203.93759081056464,284.2222795992713]
["897","NV","CARSON CITY",309.54005032021951,320.36312900274476,204.2423178179323,284.64696935041167,309.54005032021951,320.36312900274476,204.2423178179323,284.64696935041167]
["898","NV","ELKO",300.19099818511796,310.68718693284933,198.07357785843919,276.04976406533575,300.19099818511796,310.68718693284933,198.07357785843919,276.04976406533575]
["900","CA","LOS ANGELES",{"$f":"H830*1.175","v":464.60101936533772},{"$f":"I830*1.175","v":480.8458102522377},{"$f":"J830*1.175","v":306.55544882668841},{"$f":"K830*1.175","v":427.23800032546785},395.40512286411717,409.23047681041504,260.89825432058586,363.60680878763219,"Los Angeles County"]
["901","CA","LOS ANGELES",{"$f":"H831*1.175","v":464.60101936533772},480.8458102522377,306.55544882668841,427.23800032546785,395.40512286411717,409.23047681041504,260.89825432058586,363.60680878763219,"Los Angeles County"]
["902","CA","LOS ANGELES",464.60101936533772,480.8458102522377,306.55544882668841,427.23800032546785,395.40512286411717,409.23047681041504,260.89825432058586,363.60680878763219,"Los Angeles County"]
["903","CA","INGLEWOOD",419.03582126140435,433.68742340341146,276.49038402181679,385.33713633478789,356.62623086076962,369.09567949226505,235.31096512495046,327.94649900833008,"Los Angeles County"]
["904","CA","INGLEWOOD",419.03582126140435,433.68742340341146,276.49038402181679,385.33713633478789,356.62623086076962,369.09567949226505,235.31096512495046,327.94649900833008,"Los Angeles County"]
["905","CA","INGLEWOOD",419.03582126140435,433.68742340341146,276.49038402181679,385.33713633478789,356.62623086076962,369.09567949226505,235.31096512495046,327.94649900833008,"Los Angeles County"]
["906","CA","LONG BEACH",423.04638084939052,437.83821234762087,279.13665220310656,389.02516840346055,360.03947306331105,372.62826582776245,237.56310825796302,331.08524970507278,"Los Angeles County"]
["907","CA","LONG BEACH",423.04638084939052,437.83821234762087,279.13665220310656,389.02516840346055,360.03947306331105,372.62826582776245,237.56310825796302,331.08524970507278,"Los Angeles County"]
["908","CA","LONG BEACH",423.04638084939052,437.83821234762087,279.13665220310656,389.02516840346055,360.03947306331105,372.62826582776245,237.56310825796302,331.08524970507278,"Los Angeles County"]
["910","CA","PASADENA",419.91966883116874,434.60217473435665,277.07356889905549,386.14990525383701,357.37844155844147,369.87419126328223,235.80729268004723,328.63821723730808,"Los Angeles County"]
["911","CA","PASADENA",419.91966883116874,434.60217473435665,277.07356889905549,386.14990525383701,357.37844155844147,369.87419126328223,235.80729268004723,328.63821723730808,"Los Angeles County"]
["912","CA","PASADENA",419.91966883116874,434.60217473435665,277.07356889905549,386.14990525383701,357.37844155844147,369.87419126328223,235.80729268004723,328.63821723730808,"Los Angeles County"]
["913","CA","VAN NUYS",426.75668888458569,441.67825143299768,281.58480685108452,392.43709502323787,363.1971820294346,375.89638419829589,239.64664412858255,333.9890170410535,"Los Angeles County"]
["914","CA","VAN NUYS",426.75668888458569,441.67825143299768,281.58480685108452,392.43709502323787,363.1971820294346,375.89638419829589,239.64664412858255,333.9890170410535,"Los Angeles County"]
["915","CA","VAN NUYS",426.75668888458569,441.67825143299768,281.58480685108452,392.43709502323787,363.1971820294346,375.89638419829589,239.64664412858255,333.9890170410535,"Los Angeles County"]
["916","CA","VAN NUYS",426.75668888458569,441.67825143299768,281.58480685108452,392.43709502323787,363.1971820294346,375.89638419829589,239.64664412858255,333.9890170410535,"Los Angeles County"]
["917","CA","ALHAMBRA",424.18529807167891,439.0169518504091,279.88813845841446,390.07249438059995,361.00876431632247,373.63144838332687,238.20267102843783,331.9765909622127,"Los Angeles County"]
["918","CA","ALHAMBRA",424.18529807167891,439.0169518504091,279.88813845841446,390.07249438059995,361.00876431632247,373.63144838332687,238.20267102843783,331.9765909622127,"Los Angeles County"]
["919","CA","SAN DIEGO",{"$f":"H848","v":364.7457840819543},377.49913317572896,240.66845074862098,335.41308116627266,364.7457840819543,377.49913317572896,240.66845074862098,335.41308116627266]
["920","CA","SAN DIEGO",364.7457840819543,377.49913317572896,240.66845074862098,335.41308116627266,364.7457840819543,377.49913317572896,240.66845074862098,335.41308116627266]
["921","CA","SAN DIEGO",364.7457840819543,377.49913317572896,240.66845074862098,335.41308116627266,364.7457840819543,377.49913317572896,240.66845074862098,335.41308116627266]
["922","CA","PALM SPRINGS",{"$f":"H851*1.1","v":392.9936592592594},{"$f":"I851*1.1","v":406.73469629629648},{"$f":"J851*1.1","v":259.30710992592606},{"$f":"K851*1.1","v":361.38927407407414},357.26696296296308,369.75881481481497,235.73373629629637,328.53570370370375,"Outer LA Metro"]
["923","CA","SAN BERNARDINO",{"$f":"H852*1.1","v":386.40482416534189},399.91548235294124,254.95963065818768,355.33031033386334,351.27711287758353,363.55952941176474,231.78148241653423,323.02755484896664,"Outer LA Metro"]
["924","CA","SAN BERNARDINO",386.40482416534189,399.91548235294124,254.95963065818768,355.33031033386334,351.27711287758353,363.55952941176474,231.78148241653423,323.02755484896664,"Outer LA Metro"]
["925","CA","RIVERSIDE",395.92660263872727,409.77019014357796,261.24233980403579,364.08635137757102,359.93327512611569,372.51835467597994,237.49303618548709,330.98759216142815,"Outer LA Metro"]
["926","CA","SANTA ANA",390.56582538310403,404.22197312377199,257.7051640141454,359.15668557956775,355.05984125736728,367.47452102161088,234.27742183104124,326.506077799607,"Outer LA Metro"]
["927","CA","SANTA ANA",390.56582538310403,404.22197312377199,257.7051640141454,359.15668557956775,355.05984125736728,367.47452102161088,234.27742183104124,326.506077799607,"Outer LA Metro"]
["928","CA","ANAHEIM",396.58209968968197,410.44860667183866,261.67485326027935,364.68913363072153,360.52918153607447,373.13509697439878,237.88623023661756,331.53557602792864,"Outer LA Metro"]
["930","CA","OXNARD",394.64322857142872,408.44194285714303,260.3955372857144,362.9061857142857,358.76657142857152,371.31085714285729,236.72321571428577,329.91471428571424,"Outer LA Metro"]
["931","CA","SANTA BARBARA",357.51191198428285,370.01232848722987,235.89535982711197,328.76095402750491,357.51191198428285,370.01232848722987,235.89535982711197,328.76095402750491]
["932","CA","BAKERSFIELD",360.84009538702122,373.45688193901492,238.091379022674,331.82148631743553,360.84009538702122,373.45688193901492,238.091379022674,331.82148631743553]
["933","CA","BAKERSFIELD",360.84009538702122,373.45688193901492,238.091379022674,331.82148631743553,360.84009538702122,373.45688193901492,238.091379022674,331.82148631743553]
["934","CA","SAN LUIS OBISPO",361.7743348982786,374.42378716744923,238.707813771518,332.6805946791863,361.7743348982786,374.42378716744923,238.707813771518,332.6805946791863]
["935","CA","MOJAVE",{"$f":"H863*1.175","v":414.37098011976059},{"$f":"I863*1.175","v":428.85947592814375},{"$f":"J863*1.175","v":273.41240440000001},{"$f":"K863*1.175","v":381.04743976047905},352.65615329341324,364.9867880239521,232.69140800000002,324.29569341317364,"Los Angeles County"]
["936","CA","FRESNO",365.84714263685419,378.63900077100999,241.39515484965301,336.42586892829598,365.84714263685419,378.63900077100999,241.39515484965301,336.42586892829598]
["937","CA","FRESNO",365.84714263685419,378.63900077100999,241.39515484965301,336.42586892829598,365.84714263685419,378.63900077100999,241.39515484965301,336.42586892829598]
["938","CA","FRESNO",365.84714263685419,378.63900077100999,241.39515484965301,336.42586892829598,365.84714263685419,378.63900077100999,241.39515484965301,336.42586892829598]
["939","CA","SALINAS",378.21659828422224,391.44095486758664,249.55683308466979,347.80057814248408,378.21659828422224,391.44095486758664,249.55683308466979,347.80057814248408]
["940","CA","SAN FRANCISCO",{"$f":"H868*1.315","v":552.79794666666658},572.12654620046612,364.75000180233093,508.3421677389278,420.37866666666662,435.07722144522137,277.37642722610718,386.57199067599072,"Bay Area"]
["941","CA","SAN FRANCISCO",552.79794666666658,572.12654620046612,364.75000180233093,508.3421677389278,420.37866666666662,435.07722144522137,277.37642722610718,386.57199067599072,"Bay Area"]
["942","CA","SACRAMENTO",366.21272036130978,379.01736093338349,241.63637223560411,336.7620470455401,366.21272036130978,379.01736093338349,241.63637223560411,336.7620470455401]
["943","CA","PALO ALTO",{"$f":"H871*1.315","v":517.03022427263124},{"$f":"I871*1.315","v":535.10820414230352},{"$f":"J871*1.315","v":341.14955812058821},{"$f":"K871*1.315","v":475.45087057238459},393.17887777386409,406.92639098274037,259.42932176470589,361.55959739344837,"Bay Area"]
["944","CA","SAN MATEO",{"$f":"H872*1.315","v":520.25401047669118},538.44471014370833,343.27669341628109,478.41540124255164,395.63042621801611,409.46365790396072,261.0469151454609,363.81399334034347,"Bay Area"]
["945","CA","VALLEJO",498.3938906688598,515.82025048245634,328.85283604237952,458.31326309758776,379.00676096491242,392.25874561403526,250.07820231359659,348.52719627192988,"Bay Area"]
["946","CA","OAKLAND",523.90029350468922,542.21848558527267,345.68260275269193,481.76845171934701,398.40326502257733,412.33344911427582,262.87650399444254,366.36384161167075,"Bay Area"]
["947","CA","BERKELEY",522.79287118773948,541.0723422082898,344.95189762880534,480.75008784047378,397.56111877394636,411.46185719261587,262.32083469871128,365.5894204110067,"Bay Area"]
["948","CA","RICHMOND",509.09138907407396,526.89178729344712,335.91131479779199,468.15047316951564,387.14174074074066,400.67816524216516,255.44586676638176,356.00796438746437,"Bay Area"]
["949","CA","SAN RAFAEL",520.97906589958154,539.19511715481167,343.75510323744771,479.08214801255224,396.1817991631799,410.03430962343094,261.41072489539749,364.32102510460248,"Bay Area"]
["950","CA","SANTA CRUZ",387.09835473340593,400.63326224156691,255.41723958650709,355.96806746463545,387.09835473340593,400.63326224156691,255.41723958650709,355.96806746463545]
["951","CA","SAN JOSE",{"$f":"H879*1.315","v":534.17884589273353},{"$f":"I879*1.315","v":552.856427916955},{"$f":"J879*1.315","v":352.46465037908303},{"$f":"K879*1.315","v":491.22040723702423},406.21965467128024,420.42313910034602,268.03395466089967,373.55164048442907,"Bay Area"]
["952","CA","STOCKTON",370.93637518910737,383.90617851739779,244.7531586081694,341.10582753403924,370.93637518910737,383.90617851739779,244.7531586081694,341.10582753403924]
["953","CA","MODESTO",368.68276280834908,381.57376850094869,243.26616842504743,339.03344971537001,368.68276280834908,381.57376850094869,243.26616842504743,339.03344971537001]
["954","CA","SANTA ROSA",391.54181476224272,405.23208800567784,258.34914637686308,360.05418630234215,391.54181476224272,405.23208800567784,258.34914637686308,360.05418630234215]
["955","CA","EUREKA",379.00891982182634,392.26097995545661,250.07962678173726,348.52918151447665,379.00891982182634,392.26097995545661,250.07962678173726,348.52918151447665]
["956","CA","SACRAMENTO",366.21272036130978,379.01736093338349,241.63637223560411,336.7620470455401,366.21272036130978,379.01736093338349,241.63637223560411,336.7620470455401]
["957","CA","SACRAMENTO",366.21272036130978,379.01736093338349,241.63637223560411,336.7620470455401,366.21272036130978,379.01736093338349,241.63637223560411,336.7620470455401]
["958","CA","SACRAMENTO",366.21272036130978,379.01736093338349,241.63637223560411,336.7620470455401,366.21272036130978,379.01736093338349,241.63637223560411,336.7620470455401]
["959","CA","MARYSVILLE",374.32274397590362,387.4109518072288,246.98756998493977,344.2198659638554,374.32274397590362,387.4109518072288,246.98756998493977,344.2198659638554]
["960","CA","REDDING",382.22422489959831,395.58870828769614,252.20116601679442,351.48591310697333,382.22422489959831,395.58870828769614,252.20116601679442,351.48591310697333]
["961","CA","SUSANVILLE",379.57367666422829,392.8454835405999,250.45226756400879,349.04852084857356,379.57367666422829,392.8454835405999,250.45226756400879,349.04852084857356]
["967","HI","HILO",374.91553409509766,388.02446885366749,247.37870782897161,344.76498415038702,374.91553409509766,388.02446885366749,247.37870782897161,344.76498415038702]
["968","HI","HONOLULU",384.96694835680762,398.42733116648617,254.01088400144459,354.00806789454685,384.96694835680762,398.42733116648617,254.01088400144459,354.00806789454685]
["969","HI","STATES & POSS., GUAM",351.07126499361982,363.34648404934069,231.64565880051046,322.83826116546157,351.07126499361982,363.34648404934069,231.64565880051046,322.83826116546157]
["970","OR","PORTLAND",338.09930646515528,349.9209605373635,223.08643399664149,310.90950209907635,338.09930646515528,349.9209605373635,223.08643399664149,310.90950209907635]
["971","OR","PORTLAND",338.09930646515528,349.9209605373635,223.08643399664149,310.90950209907635,338.09930646515528,349.9209605373635,223.08643399664149,310.90950209907635]
["972","OR","PORTLAND",338.09930646515528,349.9209605373635,223.08643399664149,310.90950209907635,338.09930646515528,349.9209605373635,223.08643399664149,310.90950209907635]
["973","OR","SALEM",340.00563323541758,351.89394208980281,224.3442763911037,312.66252287033154,340.00563323541758,351.89394208980281,224.3442763911037,312.66252287033154]
["974","OR","EUGENE",334.6405596919127,346.34127856225933,220.80426580231068,307.72890629011556,334.6405596919127,346.34127856225933,220.80426580231068,307.72890629011556]
["975","OR","MEDFORD",331.57453924914677,343.16805460750857,218.7812283276451,304.90945392491477,331.57453924914677,343.16805460750857,218.7812283276451,304.90945392491477]
["976","OR","KLAMATH FALLS",330.16791300639653,341.71224562899789,217.85310092110876,303.61594797441359,330.16791300639653,341.71224562899789,217.85310092110876,303.61594797441359]
["977","OR","BEND",331.72511308767469,343.3238932655654,218.88058073697587,305.047918678526,331.72511308767469,343.3238932655654,218.88058073697587,305.047918678526]
["978","OR","PENDLETON",326.18120398440885,337.586141186661,215.22256994369857,299.94984841922917,326.18120398440885,337.586141186661,215.22256994369857,299.94984841922917]
["979","OR","VALE",304.94933333333341,315.61189743589756,201.21324717948721,280.42543589743599,304.94933333333341,315.61189743589756,201.21324717948721,280.42543589743599]
["980","WA","SEATTLE",348.80782091917587,361.0038985736926,230.15218141838352,320.75684231378762,348.80782091917587,361.0038985736926,230.15218141838352,320.75684231378762]
["981","WA","SEATTLE",348.80782091917587,361.0038985736926,230.15218141838352,320.75684231378762,348.80782091917587,361.0038985736926,230.15218141838352,320.75684231378762]
["982","WA","EVERETT",339.58705158893935,351.46072472141975,224.06808568303757,312.27760338423451,339.58705158893935,351.46072472141975,224.06808568303757,312.27760338423451]
["983","WA","TACOMA",340.22088296543109,352.11671803415248,224.48630358184099,312.86046230737202,340.22088296543109,352.11671803415248,224.48630358184099,312.86046230737202]
["984","WA","TACOMA",340.22088296543109,352.11671803415248,224.48630358184099,312.86046230737202,340.22088296543109,352.11671803415248,224.48630358184099,312.86046230737202]
["985","WA","OLYMPIA",339.7320552995393,351.61079849183074,224.16376278173442,312.41094595726861,339.7320552995393,351.61079849183074,224.16376278173442,312.41094595726861]
["986","WA","VANCOUVER",339.86109987669545,351.74435511713926,224.24890964241675,312.52961282367443,339.86109987669545,351.74435511713926,224.24890964241675,312.52961282367443]
["987","WA","SEATTLE",348.80782091917587,361.0038985736926,230.15218141838352,320.75684231378762,348.80782091917587,361.0038985736926,230.15218141838352,320.75684231378762]
["988","WA","WENATCHEE",314.05810526315787,325.03915789473689,207.22344421052634,288.80168421052633,314.05810526315787,325.03915789473689,207.22344421052634,288.80168421052633]
["989","WA","YAKIMA",{"$f":"H912","v":328.92340664961637},340.42422506393865,217.03194429667519,302.47152429667517,328.92340664961637,340.42422506393865,217.03194429667519,302.47152429667517]
["990","WA","SPOKANE",305.71190841813132,316.40113598519883,201.7164134181314,281.12668501387611,305.71190841813132,316.40113598519883,201.7164134181314,281.12668501387611]
["991","WA","SPOKANE",305.71190841813132,316.40113598519883,201.7164134181314,281.12668501387611,305.71190841813132,316.40113598519883,201.7164134181314,281.12668501387611]
["992","WA","SPOKANE",305.71190841813132,316.40113598519883,201.7164134181314,281.12668501387611,305.71190841813132,316.40113598519883,201.7164134181314,281.12668501387611]
["993","WA","RICHLAND",312.10124966382784,323.0138807709547,205.93226162259077,287.00219811743614,312.10124966382784,323.0138807709547,205.93226162259077,287.00219811743614]
["994","WA","CLARKSTON",290.79767335510974,300.96542417172196,191.87562566028939,267.41184647690159,290.79767335510974,300.96542417172196,191.87562566028939,267.41184647690159]
["995","AK","ANCHORAGE",373.50575175470999,386.56539342445518,246.44849794975991,343.46857591429625,373.50575175470999,386.56539342445518,246.44849794975991,343.46857591429625]
["996","AK","ANCHORAGE",373.50575175470999,386.56539342445518,246.44849794975991,343.46857591429625,373.50575175470999,386.56539342445518,246.44849794975991,343.46857591429625]
["997","AK","FAIRBANKS",374.97698157700808,388.08806484893142,247.41925242446572,344.82149005158436,374.97698157700808,388.08806484893142,247.41925242446572,344.82149005158436]
["998","AK","JUNEAU",371.48340267459139,384.4723328380386,245.11410111441307,341.60886329866264,371.48340267459139,384.4723328380386,245.11410111441307,341.60886329866264]
["999","AK","KETCHIKAN",393.97532165381921,407.75068255080583,259.95483548703578,362.29199159074983,393.97532165381921,407.75068255080583,259.95483548703578,362.29199159074983]

{"sheet":"Targeting Self-Score","index":10,"n_rows":30,"n_cols":7,"rows_kept":30,"cut":false,"hidden":false,"merged":[[26,0,26,1],[27,0,27,1],[28,0,28,1],[29,0,29,1],[18,0,18,1],[23,0,23,1],[0,0,0,6],[1,0,1,6],[25,0,25,1],[19,0,19,1],[20,0,20,1],[21,0,21,1],[24,0,24,1],[12,3,12,5],[13,3,13,5],[14,3,14,5],[15,3,15,5],[16,3,16,5]]}
["Rental Projects: Targeting Self-Score"]
[{"$f":"Targeting!A2:M2","v":"Version 5.2 Updated 1/27/22"}]
[]
["Project Name",{"$f":"IF(+Targeting!B5=\"\",\"\",+Targeting!B5)","v":""},"Proposed No. of Units","Proposed AMI Targets","Proposed No. of Units @ 50% AMI or less","Proposed No. of Units  >50% & <=80% AMI","WAAMIT Calc"]
[null,null,{"$f":"+Targeting!R41","v":0},0.5,{"$f":"IF(D5=\"\",0,IF(D5<=0.5,C5,0))","v":0},{"$f":"IF(D5>0.5,C5,0)","v":0},{"$f":"IF(D5>0.5,C5*D5,0)","v":0}]
[null,null,{"$f":"Targeting!S41","v":0},null,0,0,0]
["Note:",null,{"$f":"+Targeting!T41","v":0},null,0,0,0]
["1. No additional points given for units targeted",null,{"$f":"+Targeting!U41","v":0},null,0,0,0]
["below 50% AMI.",null,{"$f":"+Targeting!V41","v":0},null,0,0,0]
[null,null,{"$f":"+Targeting!W41","v":0},null,0,0,0]
["2. In order to score your own project, you must",null,{"$f":"+Targeting!X41","v":0},null,0,0,0]
["fill in the AMI target(s) greater than 50%",null,{"$f":"SUM(C5:C11)","v":0},"Total Targeted",{"$f":"SUM(E5:E11)","v":0},{"$f":"SUM(F5:F11)","v":0},{"$f":"SUM(G5:G11)","v":0}]
["proposed in your Rental Projects Worksheet.",null,{"$f":"Targeting!A43","v":0},"Non-Restricted Manager Units"]
[null,null,{"$f":"Targeting!A44","v":0},"Non Income-Restricted Special Needs Units"]
["3. Shaded cells are password protected.",null,{"$f":"Targeting!A46","v":0},"Other Non-Restricted Units"]
[null,null,{"$f":"+C12+C13+C14+C15","v":0},"Total Units - must match Targeting Worksheet"]
[null,null,{"$f":"COUNTIF(Targeting!N20:N299,\"=Fail\")","v":0},"Units failing rent cap of 30% income"]
[]
["Step I",null,"Line","Score"]
["Percent of total units at 50% AMI or lower",null,1,{"$f":"IF($C$16=Targeting!$A$47,IF($C$12>0,+$E$12/$C$16*100,0),\"Fill in targeting\")","v":"Fill in targeting"}]
["Subtract 20 from line above",null,2,{"$f":"IF(D20<20,0,IF(C12>0,+D20-20,0))","v":0}]
["Multiply this percentage by .50 (base score)",null,3,{"$f":"IF($D$21*0.5>=20,20,$D$21*0.5)","v":0}]
[]
["Step II",null,"Line","Score"]
["Subtract base score from 20 (remaining possible points)",null,4,{"$f":"IF(D20<20,0,IF(C12>0,20-D22,0))","v":0}]
["Weighted Average Area Median Income Target (WAAMIT) for units between 50% and 80% AMI",null,5,{"$f":"IF($D$25>0,IF($F12<=0,0,$G$12/$F$12*100),0)","v":0}]
["Divide remaining possible points by 30 ",null,6,{"$f":"+D25/30","v":0}]
["Line 5 subtracted from .80",null,7,{"$f":"IF(D26>0,80-D26,0)","v":0}]
["Multiply line 6 by line 7 (adjustment)",null,8,{"$f":"+D28*D27","v":0}]
["Base score plus adjustment (final score)",null,9,{"$f":"+D29+D22","v":0}]

{"sheet":"Subsidy Per Unit Score","index":11,"n_rows":18,"n_cols":5,"rows_kept":18,"cut":false,"hidden":true,"merged":[[7,0,7,2],[8,0,8,2],[9,0,9,2],[10,0,10,2],[17,1,17,2],[12,1,12,2],[13,1,13,2],[14,1,14,2],[15,1,15,2],[6,0,6,2],[4,0,4,1],[4,2,4,4],[0,0,0,4],[1,0,1,4]]}
["Rental Projects: Subsidy Per Unit Score"]
[{"$f":"Targeting!A2:M2","v":"Version 5.2 Updated 1/27/22"}]
[]
[]
["Project Name",null,{"$f":"IF(+Targeting!B5=\"\",\"\",+Targeting!B5)","v":""}]
[]
["Subsidy Requested",null,null,{"$f":"IF('Sources & Uses of Funds'!E94=0,0,'Sources & Uses of Funds'!E94)","v":0},"Line 1"]
["AHP Project Units (income restricted units)",null,null,{"$f":"IF(Targeting!A41=\"\",0,Targeting!A41)","v":0},"Line 2"]
["Subsidy per Unit (line 1 divided by line 2)",null,null,{"$f":"IF(D7=0,0,D7/D8)","v":0},"Line 3"]
["High End of Rental Project Subsidy per Unit Range",null,null,40000,"Line 4"]
["Low End of Rental Project Subsidy per Unit Range",null,null,15000,"Line 5"]
[]
["Step 1:","Determine Subsidy per Unit Range Difference (Subtract line 5 from line 4)",null,{"$f":"+D10-D11","v":25000},"Line 6"]
["Step 2:","Determine Scoring Factor (Divide 7 possible category points by line 6)",null,{"$f":"7/D13","v":2.7999999999999998E-4},"Line 7"]
["Step 3:","Subtract line 3 by line 5",null,{"$f":"IF(D9=0,0,D9-D11)","v":0},"Line 8"]
["Step 4:","Multiply line 8 by Scoring Factor",null,{"$f":"IF(D15=0,0,+D14*D15)","v":0},"Line 9"]
[]
["Step 5:","Score (7 possible points subtracted by line 9)",null,{"$f":"IF(D7=0,0,IF(7-D16>7,7,IF(7-D16<0,\"0.00\",7-D16)))","v":0}]

{"sheet":"AHP Application Comparison","index":12,"n_rows":42,"n_cols":13,"rows_kept":42,"cut":false,"hidden":false,"merged":[[4,1,4,7]]}
[null,null,null,null,null,null,null,null,"AHP Application Comparison",null,null,"Hidden to prevent data entry; field needs to be unlocked for macro to update"]
[null,null,null,null,null,null,null,null,{"$f":"Targeting!A2","v":"Version 5.2 Updated 1/27/22"},null,null,"Status (Unlocked)","Not Yet Compared"]
[null,null,null,null,null,null,null,null,null,null,null,"Field Text Default","Not Yet Compared"]
[null,"Instructions"]
[null,"Click the \"Run Comparison Now\" button below to validate that the below referenced fields have matching values between the project's AHP Application and this Rental AHP Application Financial Workbook."]
[]
[null,"Comparison Last Executed",{"$f":"COMPARISON_LAST_RUN","v":"Not Yet Compared"}]
[]
[null,"Field","Financial Workbook Value","EFORM_FIELD_NAME","EFORM_VALUE_IF_BLANK","EFORM_FIELD_VALUE","AHP Application Value","Match?"]
[null,"Direct Subsidy Requested",{"$f":"IF('Sources & Uses of Funds'!E94=\"\",0,'Sources & Uses of Funds'!E94)","v":0},"DIR_SUB_AMT",0,null,{"$f":"IF(F10=\"\",\"\",F10)","v":""},{"$f":"IF(I10=\"\",\"\",IF(IFERROR(DATEVALUE(TEXT(COMPARISON_LAST_RUN,\"mm/dd/yyy\")),0)<=0,COMPARISON_DEFAULT_STATUS,IF(I10=2,\"Yes\",\"No\")))","v":"Not Yet Compared"},{"$f":"IF(C10=\"\",\"\",IF(IFERROR(DATEVALUE(TEXT(COMPARISON_LAST_RUN,\"mm/dd/yyy\")),0)<=0,1,IF(IF(ISBLANK(C10),0,C10)=IF(ISBLANK(G10),0,G10),2,0)))","v":1}]
[null,"Total Number of Units in Project",{"$f":"IF(Targeting!A47=\"\",0,Targeting!A47)","v":0},"TOTAL_UNITS",0,null,"","Not Yet Compared",1]
[null,"Total Income-Restricted Units",{"$f":"IF(Targeting!A41=\"\",0,Targeting!A41)","v":0},"INCOME_RESTRICTED_UNITS",0,null,"","Not Yet Compared",1]
[null,"Total Non-Income Restricted Units",{"$f":"SUM(Targeting!A43:A46)","v":0},"NONINCOME_RESTRICTED_UNITS",0,null,"","Not Yet Compared",1]
[null,"Manager's Units",{"$f":"SUM(Targeting!A42:A43)","v":0},"MANAGER_UNITS",0,null,"","Not Yet Compared",1]
[null,"Number of Homeless Units",{"$f":"IF(Targeting!A49=\"\",0,Targeting!A49)","v":0},"HOMELESS_UNITS",0,null,"","Not Yet Compared",1]
[null,"Total Number of Special Needs Units",{"$f":"IF(Targeting!A50=\"\",0,Targeting!A50)","v":0},"SPECIALNEEDS_TOTAL_UNITS",0,null,"","Not Yet Compared",1]
[null,"Targeting Weighted Average",{"$f":"IF(Targeting!A52=\"\",0,ROUND(Targeting!A52,7))","v":0},"[CALCULATED]",0,{"$f":"IF(F12=\"\",\"\",ROUND(IFERROR(SUMPRODUCT(F18:F29,F30:F41)/SUM(F18:F29),E17),7))","v":""},{"$f":"IF(F17=\"\",\"\",F17)","v":""},{"$f":"IF(I17=\"\",\"\",IF(IFERROR(DATEVALUE(TEXT(COMPARISON_LAST_RUN,\"mm/dd/yyy\")),0)<=0,COMPARISON_DEFAULT_STATUS,IF(I17=2,\"Yes\",\"No\")))","v":"Not Yet Compared"},{"$f":"IF(C17=\"\",\"\",IF(IFERROR(DATEVALUE(TEXT(COMPARISON_LAST_RUN,\"mm/dd/yyy\")),0)<=0,1,IF(IF(ISBLANK(C17),0,C17)=IF(ISBLANK(G17),0,G17),2,0)))","v":1}]
[null,"INCOME_RESTRICTED_AMI_TABLE","N/A","INCOME_RESTRICTED_TBL_ROW1_UNITS",0,null,{"$f":"IF(F18=\"\",\"\",F18)","v":""}]
[null,"INCOME_RESTRICTED_AMI_TABLE","N/A","INCOME_RESTRICTED_TBL_ROW2_UNITS",0,null,""]
[null,"INCOME_RESTRICTED_AMI_TABLE","N/A","INCOME_RESTRICTED_TBL_ROW3_UNITS",0,null,""]
[null,"INCOME_RESTRICTED_AMI_TABLE","N/A","INCOME_RESTRICTED_TBL_ROW4_UNITS",0,null,""]
[null,"INCOME_RESTRICTED_AMI_TABLE","N/A","INCOME_RESTRICTED_TBL_ROW5_UNITS",0,null,""]
[null,"INCOME_RESTRICTED_AMI_TABLE","N/A","INCOME_RESTRICTED_TBL_ROW6_UNITS",0,null,""]
[null,"INCOME_RESTRICTED_AMI_TABLE","N/A","INCOME_RESTRICTED_TBL_ROW7_UNITS",0,null,""]
[null,"INCOME_RESTRICTED_AMI_TABLE","N/A","INCOME_RESTRICTED_TBL_ROW8_UNITS",0,null,""]
[null,"INCOME_RESTRICTED_AMI_TABLE","N/A","INCOME_RESTRICTED_TBL_ROW9_UNITS",0,null,""]
[null,"INCOME_RESTRICTED_AMI_TABLE","N/A","INCOME_RESTRICTED_TBL_ROW10_UNITS",0,null,""]
[null,"INCOME_RESTRICTED_AMI_TABLE","N/A","INCOME_RESTRICTED_TBL_ROW11_UNITS",0,null,""]
[null,"INCOME_RESTRICTED_AMI_TABLE","N/A","INCOME_RESTRICTED_TBL_ROW12_UNITS",0,null,""]
[null,"INCOME_RESTRICTED_AMI_TABLE","N/A","INCOME_RESTRICTED_TBL_ROW1_AMI",0,null,""]
[null,"INCOME_RESTRICTED_AMI_TABLE","N/A","INCOME_RESTRICTED_TBL_ROW2_AMI",0,null,""]
[null,"INCOME_RESTRICTED_AMI_TABLE","N/A","INCOME_RESTRICTED_TBL_ROW3_AMI",0,null,""]
[null,"INCOME_RESTRICTED_AMI_TABLE","N/A","INCOME_RESTRICTED_TBL_ROW4_AMI",0,null,""]
[null,"INCOME_RESTRICTED_AMI_TABLE","N/A","INCOME_RESTRICTED_TBL_ROW5_AMI",0,null,""]
[null,"INCOME_RESTRICTED_AMI_TABLE","N/A","INCOME_RESTRICTED_TBL_ROW6_AMI",0,null,""]
[null,"INCOME_RESTRICTED_AMI_TABLE","N/A","INCOME_RESTRICTED_TBL_ROW7_AMI",0,null,""]
[null,"INCOME_RESTRICTED_AMI_TABLE","N/A","INCOME_RESTRICTED_TBL_ROW8_AMI",0,null,""]
[null,"INCOME_RESTRICTED_AMI_TABLE","N/A","INCOME_RESTRICTED_TBL_ROW9_AMI",0,null,""]
[null,"INCOME_RESTRICTED_AMI_TABLE","N/A","INCOME_RESTRICTED_TBL_ROW10_AMI",0,null,""]
[null,"INCOME_RESTRICTED_AMI_TABLE","N/A","INCOME_RESTRICTED_TBL_ROW11_AMI",0,null,""]
[null,"INCOME_RESTRICTED_AMI_TABLE","N/A","INCOME_RESTRICTED_TBL_ROW12_AMI",0,null,""]
[null,"Households Requiring Large Units",{"$f":"Targeting!A53","v":0},"LARGE_UNITS",0,null,"",{"$f":"IF(I42=\"\",\"\",IF(IFERROR(DATEVALUE(TEXT(COMPARISON_LAST_RUN,\"mm/dd/yyy\")),0)<=0,COMPARISON_DEFAULT_STATUS,IF(I42=2,\"Yes\",\"No\")))","v":"Not Yet Compared"},{"$f":"IF(C42=\"\",\"\",IF(IFERROR(DATEVALUE(TEXT(COMPARISON_LAST_RUN,\"mm/dd/yyy\")),0)<=0,1,IF(IF(ISBLANK(C42),0,C42)=IF(ISBLANK(G42),0,G42),2,0)))","v":1}]

{"sheet":"Data Import Summary","index":13,"n_rows":47,"n_cols":15,"rows_kept":47,"cut":false,"hidden":true,"merged":[]}
["IRIS Tab","Question","ID ","Financial Workbook Worksheet","Cell","Additional field name details","Type","Required ","Validation","Export?","Link to Workbook","DB Field Name / \nDynamic Framework Question ID","DB Field Type  ","Dynamic Framework TABLE.COLUMN_NAME","Additional Notes"]
["Basic Review","Sources = Uses",null,"Sources & Uses of Funds","O94",null,"Number","Y","If cell =0 then \"Yes\",  if not equal to zero then \"No\".","Yes",{"$f":"IF('Sources & Uses of Funds'!$O$94=0,1,0)","v":1}]
["Basic Review","Cash Flow",null,"15-Year Op Pro Forma","F47:T47",null,"Number","Y","If sum of cells is >=0 then \"Yes\", if not then \"No\".","Yes",{"$f":"SUM('15-Year Op Pro Forma'!F47:T47)","v":0}]
["Basic Review","20% VLI",null,"Targeting Worksheet","A48",null,"Percentage","Y","If cell is >=20% then \"Yes\", if not then \"No\".","Yes",{"$f":"Targeting!$A$48","v":""}]
["Sources of Funds","HOME",null,"Sources of Funds Summary","A11",null,"Drop-down ( Yes, No)","N, but one cell must say \"Yes\". ","If cell = \"Yes\" then check, if other value, then blank. ","Yes if cell = \"Yes\"",{"$f":"'Sources of Funds Summary'!$A$11","v":0}]
["Sources of Funds","CDBG",null,"Sources of Funds Summary","A12",null,"Drop-down ( Yes, No)","N, but one cell must say \"Yes\". ","If cell = \"Yes\" then check, if other value, then blank. ","Yes if cell = \"Yes\"",{"$f":"'Sources of Funds Summary'!$A$12","v":0}]
["Sources of Funds","FHA",null,"Sources of Funds Summary","A13",null,"Drop-down ( Yes, No)","N, but one cell must say \"Yes\". ","If cell = \"Yes\" then check, if other value, then blank. ","Yes if cell = \"Yes\"",{"$f":"'Sources of Funds Summary'!$A$13","v":0}]
["Sources of Funds","LIHTC",null,"Sources of Funds Summary","A14",null,"Drop-down ( Yes, No)","N, but one cell must say \"Yes\". ","If cell = \"Yes\" then check, if other value, then blank. ","Yes if cell = \"Yes\"",{"$f":"'Sources of Funds Summary'!$A$14","v":0}]
["Sources of Funds","Other Federal Housing",null,"Sources of Funds Summary","A15",null,"Drop-down ( Yes, No)","N, but one cell must say \"Yes\". ","If cell = \"Yes\" then check, if other value, then blank. ","Yes if cell = \"Yes\"",{"$f":"'Sources of Funds Summary'!$A$15","v":0}]
["Sources of Funds","Tax Exempt",null,"Sources of Funds Summary","A16",null,"Drop-down ( Yes, No)","N, but one cell must say \"Yes\". ","If cell = \"Yes\" then check, if other value, then blank. ","Yes if cell = \"Yes\"",{"$f":"'Sources of Funds Summary'!$A$16","v":0}]
["Sources of Funds","State Funds",null,"Sources of Funds Summary","A17",null,"Drop-down ( Yes, No)","N, but one cell must say \"Yes\". ","If cell = \"Yes\" then check, if other value, then blank. ","Yes if cell = \"Yes\"",{"$f":"'Sources of Funds Summary'!$A$17","v":0}]
["Sources of Funds","Local Govt",null,"Sources of Funds Summary","A18",null,"Drop-down ( Yes, No)","N, but one cell must say \"Yes\". ","If cell = \"Yes\" then check, if other value, then blank. ","Yes if cell = \"Yes\"",{"$f":"'Sources of Funds Summary'!$A$18","v":0}]
["Sources of Funds","Non-Govt",null,"Sources of Funds Summary","A19",null,"Drop-down ( Yes, No)","N, but one cell must say \"Yes\". ","If cell = \"Yes\" then check, if other value, then blank. ","Yes if cell = \"Yes\"",{"$f":"'Sources of Funds Summary'!$A$19","v":0}]
["Sources of Funds","Member Perm Loans",null,"Sources of Funds Summary","A20",null,"Drop-down ( Yes, No)","N, but one cell must say \"Yes\". ","If cell = \"Yes\" then check, if other value, then blank. ","Yes if cell = \"Yes\"",{"$f":"'Sources of Funds Summary'!$A$20","v":0}]
["Sources of Funds","Other",null,"Sources of Funds Summary","A21",null,"Drop-down ( Yes, No)","N, but one cell must say \"Yes\". ","If cell = \"Yes\" then check, if other value, then blank. ","Yes if cell = \"Yes\"",{"$f":"'Sources of Funds Summary'!$A$21","v":0}]
["Project Data","Total Development Cost",null,"Sources & Uses of Funds","D94",null,"Number","Y","=Value in cell","Yes",{"$f":"'Sources & Uses of Funds'!$D$94","v":0}]
["Project Data","Committed Sources",null,"Sources & Uses of Funds","O109",null,"Number","Y","=Value in cell","Yes",{"$f":"'Sources & Uses of Funds'!$O$109","v":0}]
["Project Data","3 Bedroom or More",null,"Targeting Worksheet","E19:E39",null,"Number","Y","If any cell is equal to or greater than 3, then box should be checked, if not, blank. ","Yes, if any cell is >= 3. ",{"$f":"IF(Targeting!$AC$41>0,1,0)","v":0},null,null,null,"see line 46 and 47. Ops/TSS to check which is necessary"]
["Benchmarks","Avg Bedrooms per Unit",null,"Targeting Worksheet","A51",null,"Number","Y","=Value in cell","Yes",{"$f":"Targeting!$A$51","v":""}]
[]
["Benchmarks","Const Cost per SF for project",null,"Benchmarks","B11",null,"Currency","Y","=Value in cell","Yes",{"$f":"Benchmarks!$B$11","v":0}]
["Benchmarks","Building Type",null,"Sources & Uses of Funds","C8",null,"Drop-down (Apartments, Single Family Homes, Townhomes)","Y","=Value in cell","Yes",{"$f":"'Sources & Uses of Funds'!$C$8","v":0}]
["Benchmarks","Const/Rehab Contingency",null,"Benchmarks","B12",null,"Percentage","Y","=Value in cell","Yes",{"$f":"Benchmarks!$B$12","v":0}]
["Benchmarks","Rep Reserve Amount",null,"Benchmarks","B16",null,"Currency","Y","=Value in cell","Yes",{"$f":"Benchmarks!$B$16","v":0}]
["Benchmarks","% Over Benchmark (ops)",null,"Benchmarks","B17 and D18",null,"Currency","Y","If E16 =\"No\" then =(Value in B16- Value in D17)/Value in D17. Otherwise zero. ","Yes",{"$f":"IF(Benchmarks!E17=\"No\", (Benchmarks!B17-Benchmarks!D18)/Benchmarks!D18, 0)","v":0}]
["Benchmarks","Max Op Reserve",null,"Benchmarks","D18",null,"Currency","Y","=Value in cell","Yes",{"$f":"Benchmarks!$D$18","v":0}]
["Benchmarks","Developer Fee Percentage",null,"Benchmarks","B20",null,"Percentage","Y","=Value in cell","Yes",{"$f":"Benchmarks!$B$20","v":0}]
["Benchmarks","Soft cost contingency %",null,"Benchmarks","B21",null,"Percentage","Y","=Value in cell","Yes",{"$f":"Benchmarks!$B$21","v":0}]
["Benchmarks","Rate difference",null,"Benchmarks","B23",null,"Percentage","Y","=Value in cell","Yes",{"$f":"Benchmarks!$B$23","v":"0%"}]
["Benchmarks","Vacancy Residential",null,"Benchmarks","B24",null,"Percentage","Y","=Value in cell","Yes",{"$f":"Benchmarks!$B$24","v":""}]
["Benchmarks","Vacancy Commercial",null,"Benchmarks","B28",null,"Percentage","Y","=Value in cell if cell has a value or zero. ","Yes",{"$f":"Benchmarks!$B$28","v":""}]
["Benchmarks","Mgmt Fee per unit per month",null,"Benchmarks","B29",null,"Currency","Y","=Value in cell","Yes",{"$f":"Benchmarks!$B$29","v":"$0"}]
["Benchmarks","Oper res/unit/year",null,"Benchmarks","B30",null,"Currency","Y","=Value in cell","Yes",{"$f":"Benchmarks!$B$30","v":"$0"}]
["Benchmarks","Rep res/unit/year",null,"Benchmarks","B31",null,"Currency","Y","=Value in cell","Yes",{"$f":"Benchmarks!$B$31","v":"$0"}]
["Benchmarks","Op Cost PUPY",null,"Benchmarks","B32",null,"Currency","Y","=Value in cell","Yes",{"$f":"Benchmarks!$B$32","v":"$0"}]
["Benchmarks","DSCR",null,"Benchmarks","B34",null,"Number","N","=Value in cell if cell has a value or zero. ","Yes",{"$f":"Benchmarks!$B$34","v":""}]
["Benchmarks","Year 1 cash flow",null,"Benchmarks","B35",null,"Percentage","Y","=Value in cell","Yes",{"$f":"Benchmarks!$B$36","v":0}]
["Benchmarks","Year 1-5 cash",null,"Benchmarks","B37",null,"Currency","Y","=Value in cell","Yes",{"$f":"Benchmarks!$B$37","v":0}]
["Benchmarks","PM Fees",null,"Benchmarks","B38",null,"Currency","Y","=Value in cell","Yes",null,null,null,null,"Benchmark removed 2022"]
["Benchmarks","Term ",null,"Benchmarks","B39",null,"Number","N","=Value in cell if cell has a value or zero. ","Yes",{"$f":"Benchmarks!$B$39","v":0}]
["Benchmarks","Interest Rate",null,"Benchmarks","B40",null,"Percentage","N","=Value in cell if cell has a value or zero. ","Yes",{"$f":"Benchmarks!$B$40","v":0}]
["Application Info","Subsidy Requested",null,"Sources & Uses of Funds","E94",null,"Number","Y","=Value in cell","No",{"$f":"'Sources & Uses of Funds'!$E$94","v":0}]
["Project Data","Square Footage ",null,"Sources & Uses of Funds","L4",null,"Number","Y","=Value in cell","Yes",{"$f":"'Sources & Uses of Funds'!$L$4","v":0}]
["Benchmarks","Total construction hard costs",null,"Benchmarks","B10",null,"Currency","Y","=Value in cell","Yes",{"$f":"Benchmarks!$B$10","v":""}]
["Benchmarks","Capitalized Operating Reserve (actual number)",null,"Benchmarks","B17",null,"Currency","Y","=Value in cell","Yes",{"$f":"Benchmarks!$B$17","v":0}]
["Scoring","Households Requiring Large Units",null,"Targeting","A53",null,"Number","Y","=Value in cell","Yes",{"$f":"Targeting!$A$53","v":0},null,null,null,"New for 2021"]
["Scoring","Non-income restricted large units",null,"Targeting","A45",null,"Number","N","=Value in cell","Yes if cell = \"Yes\"",{"$f":"Targeting!$A$45","v":0},null,null,null,"Ops/TSS to check if necessary"]

{"sheet":"Version Control","index":14,"n_rows":87,"n_cols":6,"rows_kept":87,"cut":false,"hidden":true,"merged":[]}
["AHP Application Financial Workbook Changes Log"]
[]
["Updated","2022-01-12"]
["By","Rose Wirtz"]
[]
[]
["Financial Workbook","Version","Tab","Description of Change from Previous Version","Completed by, date","Approver"]
["Rental",5,"All tabs","New FHLBSF logo and version number (5.0)"]
["Rental",5,"Targeting","Locked Homeless, Special Needs, and Bedrooms per Unit cells so only other acceptable input than the drop-down choices is 0"]
["Rental",5,"Sources & Uses of Funds","Added \"Pct of Funds\" column for easier analysis by feasbility analyst "]
["Rental",5,"15-Year Op Pro Forma","Added \"Pct of Year 1 Total Expenses\" column for easier analysis by feasbility analyst "]
["Rental",5,"15-Year Commercial Op Pro Forma","Added \"Pct of Year 1 Total Expenses\" column for easier analysis by feasbility analyst "]
["Rental",5,"Benchmarks","Adjusted formula in B10 (Construction costs per square foot calculation). Calculation now factors in Site Work in the Sources & Uses of Funds tab"]
["Rental",5,"Benchmarks","Line 11 added for Total construction hard costs. Formula calculates all costs under \"New Construction/Rehab\" except for Environmental Remediation and Hard Cost Contingency. "]
["Rental",5,"Benchmarks","Formulas fixed for residential vacancy/bad debt rate (E24) and commercial vacancy and bad debt rate (E28) so that errors are no longer shown"]
["Rental",5,"Benchmarks","3 decimal places for B33, C33, D33 (debt service coverage ratio)"]
["Rental",5,"Benchmarks","Formula fixed for term of permanent financing (B39). MINIFS formula introduced so that the workbook finds the lowest hard debt term from the Sources & Uses of Funds  tab"]
["Rental",5,"Benchmarks","Formula fixed for term of interest rate assumptions (B40). MAXIFS formula introduced so that the workbook finds the highest hard-debt interest rate from the Sources & Uses of Funds  tab"]
["Rental",5,"Benchmarks","Any \"No\" response in Column E is now highlighted yellow (Conditional Formatting)"]
["Rental",5,"Data Import Summary","Import square footage figure from Sources & Uses of Funds"]
["Rental",5,"Data Import Summary","Import total construction hard costs from Benchmarks tab"]
["Rental",5,"Data Import Summary","Import the actual capitalized operating reserve calculation from Benchmarks "]
["Rental",5,"Data Import Summary","All Benchmark cell references moved one line down (highlighted)"]
["Rental",5,"All tabs","1/21/20 - removed \"Edit Scenarios\" and \"Edit Objects\" permission from most tabs"]
[]
["Rental",5.0999999999999996,"Targeting","Added Units with 3+ bedrooms cell","J. Tsang 11/13/20"]
["Rental",5.0999999999999996,"Large Units","Added Households Requiring Large Units tab and score calculation","J. Tsang 11/13/20"]
["Rental",5.0999999999999996,"AHP Application Comparison ","Macro check to include large units check  - Tappan to add","J. LeSauvage (Tappan) 12/16/20"]
["Rental",5.0999999999999996,"Benchmarks - Hard debt term - lowest","Formula fixed for term of permanent financing (B39). Replaced MINIFS formula as it is not available to non-Office 365 users (please check logic)","J. Tsang 11/13/20, formula tested 11/20/20 R. Wirtz"]
["Rental",5.0999999999999996,"Benchmarks - Interest rate - highest","Formula fixed for term of interest rate assumptions (B40). Replaced MAXIFS formula as it is not available to non-Office 365 users (please check logic)","J. Tsang 11/13/20, formula tested 11/20/20 R. Wirtz"]
["Rental",5.0999999999999996,"Subsidy per Unit","Range increased to $15,000-$40,000","J. Tsang 11/13/20"]
["Rental",5.0999999999999996,"All tabs","New version number (5.1)","R. Wirtz 11/19/20"]
["Rental",5.0999999999999996,"Sources & Uses of Funds","Unlocked debt service payment cell for one column to allow for interest-only payments or HCD mandatory debt fee payments","R. Wirtz 11/20/20"]
["Rental",5.0999999999999996,"Workbook Instructions & Notes","Added note to explain new ability to put interest-only debt payments in sources & uses tab","R. Wirtz 11/20/20"]
["Rental",5.0999999999999996,"Targeting","Adjusted formatting for 30% rent test so that it displays \"Pass\" if total rent received and rental subsidy are both 0","R. Wirtz 12/2/20"]
["Rental",5.0999999999999996,"Benchmarks","Adjusted formatting to make sure that if net cash flow in year 1 is $0, a percentage should not be calculated","R. Wirtz 11/20/20"]
["Rental",5.0999999999999996,"Targeting Self-Score","Fixed cell C17. Cell references Targeting!M19..M296, however, correct reference should be Targeting!N19..N296","R. Wirtz 11/20/20"]
["Rental",5.0999999999999996,"Targeting","Adjusted cells D19-D22 to mimic D23-D39/fixed column D to correct avg. BR calculation","R. Wirtz 11/20/20"]
["Rental",5.0999999999999996,"Benchmarks","Deleted\"site work\" from description of CCPSF","R. Wirtz 11/20/20"]
["Rental",5.0999999999999996,"Workbook Instructions & Notes","Made clear that soft debt terms do not need to be input into financial worksheets - bolded font","R. Wirtz 11/20/20"]
["Rental",5.0999999999999996,"Targeting","Changed AMI years to reference 2021 and 2020 instead of 2020 and 2019","R. Wirtz 11/20/20"]
["Rental",5.0999999999999996,"Sources & Uses of Funds","Fixed gray formatting for loan terms section for when \"soft\" debt is selected in row 97","R. Wirtz 12/2/20"]
["Rental",5.0999999999999996,"Operating Pro Forma","Removed formula from F33 to allow users to input their own mandatory debt fee payment amounts","R. Wirtz 12/2/20"]
["Rental",5.0999999999999996,"Operating Pro Forma","Added back in formula to trend management fee in line 18","R. Wirtz 12/2/20"]
["Rental",5.0999999999999996,"Operating Pro Forma","Added ROUNDDOWN formula for cell B35 - now, does not display anything in the cell if net cash flow is less than 0.1%","R. Wirtz 12/2/20"]
["Rental",5.0999999999999996,"AHP Application Comparison ","Added lines for large units and subsidy per unit, Jeff to add the macros, see above","R. Wirtz 12/2/20"]
["Rental",5.0999999999999996,"All tabs","Hid Subsidy/Unit and Households Requiring Large Units tabs","R. Wirtz 12/2/20"]
["Rental",5.0999999999999996,"Data Import Summary","Added row to import data for # of Households Requiring Large Units","J. Tsang 12/8/20"]
["Rental",5.0999999999999996,"Workbook Instructions & Notes","Removed section on Subsidy per Unit tab","R. Wirtz 12/30/20"]
["Rental",5.0999999999999996,"All tabs","Updated date to 1/26, when applications are published","R. Wirtz 12/30/20"]
[]
[]
["Rental","5.2","All tabs","New version number (5.2)","R. Wirtz 12/6/21"]
["Rental","5.2","All tabs","Updated security settings for objects (logo, pictures, etc)","R. Wirtz 12/7/21"]
["Rental","5.2","Workbook Instructions and Notes","Under Targeting, instructed users to input only homeless or special needs units, not both (input whichever they are seeking points for)","R. Wirtz 12/6/21"]
["Rental","5.2","Workbook Instructions and Notes","Under Sources & Uses, removed item #9 re: COSR","R. Wirtz 12/6/21"]
["Rental","5.2","Workbook Instructions and Notes","Under Sources & Uses, made clear that all commercial costs go in line 93","R. Wirtz 12/6/21"]
["Rental","5.2","Workbook Instructions and Notes","Under General, added language re: Bank has discretion to throw out applications with errors","R. Wirtz 12/6/21"]
["Rental","5.2","Workbook Instructions and Notes","Under Sources & Uses, matched language to disbursement wkbk re: land value, deferred interest, and waived fees (now allowed in budget)","R. Wirtz 12/6/21"]
["Rental","5.2","Targeting","Added separate cell for non-income-restricted 3BR+ units; made total 3BR cell include these units as well","R. Wirtz 12/6/21"]
["Rental","5.2","Targeting","Added new row with cells for zip code and county dropdown","R. Wirtz 12/6/21"]
["Rental","5.2","Targeting","Updated AMI years to 2022 and 2021","R. Wirtz 12/6/21"]
["Rental","5.2","Workbook Comments","Added new tab for users to include comments/details on sources & uses, op pro forma, commercial pro forma","R. Wirtz 12/6/21"]
["Rental","5.2","Workbook Comments","Add instructions for users on how to use this tab","R. Wirtz 12/10/21"]
["Rental","5.2","Benchmarks","Added RSMeans (cost estimates) tab to workbook, updated formulas to auto-calculate deviation based on zip code in Targeting tab. Adjusted CCPSF language to match IP update","R. Wirtz 12/7/21"]
["Rental","5.2","Cost Estimates by City Zip","See above - added new RSMeans (cost estimates) tab to enable CCPSF auto-calculation","R. Wirtz 12/7/21"]
["Rental","5.2","Benchmarks","Updated developer fee benchmark to 15% from 12%. Removed developer fee from calculation of total residential development costs in formula","R. Wirtz 12/6/21"]
["Rental","5.2","Benchmarks","Bifurcated benchmark to include new $10K limit for Bay Area and LA counties (tied to new county dropdown in Targeting tab)","R. Wirtz 12/7/21"]
["Rental","5.2","Benchmarks","OpEx PUPY: add asterisk for Bay Area and LA Metro ","R. Wirtz 12/10/21"]
["Rental","5.2","Benchmarks","Removed partnership management fee benchmark","R. Wirtz 12/6/21"]
["Rental","5.2","15-Year Op Pro Forma","See above - removed ability to include PM fee above the line","R. Wirtz 12/6/21"]
["Rental","5.2","Workbook Instructions and Notes","See above - clarified instructions to show PM fee as residual receipt payment only","R. Wirtz 12/6/21"]
["Rental","5.2","Benchmarks","Hard cost contingency 5% rounding - check for error","N/A","TBD - can't find error"]
["Rental","5.2","Subsidy per Unit Score","Reduced total points from 12 to 7, adjusted formula","R. Wirtz 12/6/21"]
["Rental","5.2","Households Requiring Lg. Units","Removed tab","R. Wirtz 12/6/21"]
["Rental","5.2","Data Import Summary","Updated cash flow reference","R. Wirtz 12/10/21"]
["Rental","5.2","Data Import Summary","Updated 20% VLI reference","R. Wirtz 12/10/21"]
["Rental","5.2","Data Import Summary","3BR count - include nonrestricted, so change reference?","R. Wirtz 12/10/21"]
["Rental","5.2","Data Import Summary","Updated reference for avg. br/unit","R. Wirtz 12/10/21"]
["Rental","5.2","Data Import Summary","Updated reference for CCPSF and total hard cost","R. Wirtz 12/10/21"]
["Rental","5.2","Data Import Summary","Updated reference for DSCR","R. Wirtz 12/10/21"]
["Rental","5.2","Data Import Summary","Removed formula for PM fee benchmark, strikethrough text and left note that benchmark is removed","R. Wirtz 12/10/21"]
["Rental","5.2","Data Import Summary","Updated reference for total 3BR count","R. Wirtz 12/10/21"]
["Rental","5.2","Data Import Summary","Added new line for non-income restricted 3BR","R. Wirtz 12/10/21"]
["Rental","5.2","AHP Application Comparison","Targeting Weighted Average not matching, rounding error - for Jeff","OK"]
["Rental","5.2","All tabs","New publish date when finalized","R. Wirtz 1/12/22"]
["Rental",5.2,"Cost Estimates by City Zip","Replace tab with 2022 RS Means numbers when available","R. Wirtz 1/6/22"]