{"text_format":"1","workbook":"xlsx","n_sheets":14,"sheets":["Workbook Instructions and Notes","Targeting","Sources & Uses of Funds","Sources of Funds Summary","15-Year Op Pro Forma","15-Year Commercial Op Pro Forma","Empowerment Budget","Benchmarks","Targeting Self-Score","Subsidy Per Unit Score","Households Requiring Lg. Units","AHP Application Comparison","Data Import Summary","Version Control"],"not_rendered":{"charts":0,"images":2,"macros":1,"external_links":2,"defined_names":28,"comments":3,"pivot_tables":0},"unopened":[],"bounds":{"document_bytes":16777216,"sheet_cells":100000,"rows_first":2000,"rows_last":500,"rows_between":2000,"halvings":0,"cell_chars":16384,"cell_head_chars":4096},"cells_cut":0,"cells_raw":0,"read":"whole","date_system":"1900"}

{"sheet":"Workbook Instructions and Notes","index":0,"n_rows":66,"n_cols":2,"rows_kept":66,"cut":false,"hidden":false,"merged":[]}
[null,"Rental AHP Application Financial Workbook"]
[null,{"$f":"Targeting!A2","v":"Version 5.1 Updated 1/26/21"}]
[]
["General Instructions and Notes"]
["1.","All shaded cells are protected and cannot be altered."]
["2.","Complete all worksheets sequentially."]
["Targeting Worksheet"]
["1.","Enter the annual 50% (very-low) AMI, adjusted for family size, based on the HUD income limit guidelines."]
["2.","Attach a copy of the relevant HUD Income Limits page showing the income data for this project."]
["3.","If applicable, indicate which units are reserved for Homeless, Special Needs, or both. Numbers of units reserved must be consistent with the Homeless and Special Needs scoring categories to receive scoring credit."]
{"$rows_left_out":57}
{"sheet":"Targeting","index":1,"n_rows":57,"n_cols":34,"rows_kept":57,"cut":false,"hidden":false,"merged":[[0,0,0,13],[1,0,1,13],[4,8,4,11],[13,2,17,2],[13,0,17,0],[16,6,17,6],[16,11,17,11],[8,0,11,0],[4,1,4,6],[13,1,17,1],[13,4,17,4]]}
["Rental Projects: Targeting"]
["Version 5.1 Updated 1/26/21"]
[]
[]
["Project Name",null,null,null,null,null,null,"MSA/ PMSA",null,null,null,null,"State"]
[]
[]
[]
["2021 (if unavailable, use 2020)","Household size",null,null,"1 Person","2 Person","3 Person","4 Person","5 Person","6 person","7 Person","8 Person"]
[null,"50% AMI (HUD Very Low)"]
{"$rows_left_out":48}
{"sheet":"Sources & Uses of Funds","index":2,"n_rows":109,"n_cols":20,"rows_kept":109,"cut":false,"hidden":false,"merged":[[61,0,61,2],[60,0,60,2],[31,0,31,2],[32,0,32,2],[33,0,33,2],[48,0,48,2],[50,0,50,2],[51,0,51,1],[49,0,49,2],[46,0,46,2],[39,0,39,2],[37,0,37,2],[34,0,34,2],[55,0,55,2],[56,0,56,2],[57,0,57,1],[59,0,59,2],[52,0,52,2],[53,0,53,2],[47,0,47,1],[58,0,58,2],[54,0,54,2],[77,0,77,2],[62,0,62,2],[87,0,87,2],[73,0,73,2],[79,0,79,1],[86,0,86,2],[64,0,64,2],[75,0,75,2],[68,0,68,2],[80,0,80,2],[81,0,81,2],[84,0,84,2],[85,0,85,2],[82,0,82,2],[83,0,83,2],[69,0,69,2],[67,0,67,2],[70,0,70,2],[71,0,71,2],[76,0,76,2],[78,0,78,2],[72,0,72,1],[74,0,74,2],[0,0,0,14],[1,0,1,14],[8,0,8,2],[15,0,15,2],[38,0,38,2],[44,0,44,2],[45,0,45,2],[43,0,43,2],[35,0,35,2],[30,0,30,2],[40,0,40,2],[42,0,42,2],[19,0,19,2],[23,0,23,2],[22,0,22,2],[29,0,29,2],[27,0,27,2],[36,0,36,2],[41,0,41,1],[26,0,26,2],[25,0,25,2],[14,0,14,2],[12,0,12,2],[10,0,10,2],[6,14,7,14],[6,13,7,13],[6,6,7,6],[3,12,3,13],[6,12,7,12],[6,7,7,7],[5,7,5,14],[6,3,7,3],[6,5,7,5],[6,11,7,11],[5,4,5,6],[6,8,7,8],[3,5,3,6],[3,8,3,10],[6,9,7,9],[6,10,7,10],[3,2,3,4],[88,0,88,1],[3,0,3,1],[20,0,20,2],[28,0,28,2],[21,0,21,2],[6,15,7,15],[108,9,108,13],[13,0,13,2],[6,4,7,4],[11,0,11,2],[18,0,18,2],[16,0,16,2],[17,0,17,2],[9,0,9,2],[92,0,92,2],[97,2,97,3],[96,5,96,6],[94,3,94,4],[65,0,65,2],[66,0,66,2],[91,0,91,2],[93,0,93,2],[89,0,89,2],[63,0,63,2]]}
["Rental Projects: Sources & Uses of Funds"]
[{"$f":"Targeting!A2:M2","v":"Version 5.1 Updated 1/26/21"}]
[]
["Project Name",null,{"$f":"IF(+Targeting!B5=\"\",\"\",+Targeting!B5)","v":""},null,null,"Total Units",null,{"$f":"Targeting!A45","v":""},"Residential Square Footage",null,null,null,"Tax Credit Sales Price"]
[]
[null,null,"Select From Below",null,null,null,null,"Sources of Financing (Enter additional sources below)"]
["Construction Type",null,null,"Uses of Funds","AHP Requested","Owner Equity","LIHTC Proceeds","Permanent Loan",null,null,null,null,null,null,"(Must = 0)","Pct of Total Expenses"]
["Building Type",null,null,null,null,null,null,null,null,null,null,null,null,null,null,null,null,null,"Column1","Column2"]
["LAND COST/ACQUISITION",null,null,null,null,null,null,null,null,null,null,null,null,null,null,null,null,null,"New","Apartments"]
["Land Cost",null,null,null,null,null,null,null,null,null,null,null,null,null,{"$f":"+D10-SUM(E10:N10)","v":0},{"$f":"IF(OR($D$92=\"\",D10=\"\",D10=0),\"\",D10/$D$92)","v":""},null,null,"Rehab","Single Family Homes"]
{"$rows_left_out":100}
{"sheet":"Sources of Funds Summary","index":3,"n_rows":23,"n_cols":13,"rows_kept":23,"cut":false,"hidden":false,"merged":[[0,0,0,3],[1,0,1,3],[13,1,13,3],[7,0,7,3],[4,1,4,3],[5,0,6,3],[8,1,9,3],[8,0,9,0],[10,1,10,3],[11,1,11,3],[12,1,12,3],[14,1,14,3],[20,1,20,3],[16,1,16,3],[17,1,17,3],[18,1,18,3],[19,1,19,3],[15,1,15,3]]}
["Rental Projects: Sources of Funds Summary"]
[{"$f":"Targeting!A2","v":"Version 5.1 Updated 1/26/21"}]
[]
[]
["Project Name",{"$f":"IF(Targeting!B5:G5=\"\",\"\",Targeting!B5:G5)","v":""},null,null,null,null,null,null,null,null,null,null,"Response"]
["Please provide the required information below.",null,null,null,null,null,null,null,null,null,null,null,"Yes"]
[null,null,null,null,null,null,null,null,null,null,null,null,"No"]
["Project Financing Sources* "]
["Select                 \"Yes\" or \"No\"","Does the project intend to utilize funding from the following:"]
[]
{"$rows_left_out":14}
{"sheet":"15-Year Op Pro Forma","index":4,"n_rows":48,"n_cols":30,"rows_kept":48,"cut":false,"hidden":false,"merged":[[0,0,0,19],[1,0,1,19],[3,8,3,13],[17,0,17,2],[16,0,16,2],[6,0,6,4],[7,0,7,4],[3,5,3,6],[13,2,13,4],[10,0,10,4],[5,0,5,2],[8,0,8,4],[9,0,9,2],[3,3,3,4],[14,0,14,4],[3,0,3,2],[23,0,23,4],[22,0,22,4],[28,0,28,2],[27,0,27,2],[24,0,24,4],[25,0,25,4],[21,0,21,4],[12,0,12,1],[13,0,13,1],[11,0,11,4],[12,2,12,4],[19,0,19,4],[18,0,18,4],[20,0,20,4],[42,3,42,4],[26,0,26,4],[29,0,29,4],[37,0,37,2],[35,2,35,4],[30,0,30,4],[32,0,32,4],[34,2,34,4],[36,2,36,4],[34,0,34,1],[35,0,35,1],[33,0,33,4],[31,0,31,4],[3,15,3,17],[3,18,3,19],[47,0,47,4],[38,0,38,4],[39,0,39,4],[40,0,40,4],[41,0,41,4],[45,0,45,2],[45,3,45,4],[44,0,44,2],[43,3,43,4],[44,3,44,4],[42,0,42,2],[46,0,46,2],[46,3,46,4],[43,0,43,2]]}
["Rental Projects: 15-Year Operating Pro Forma"]
[{"$f":"'Sources & Uses of Funds'!A2","v":"Version 5.1 Updated 1/26/21"}]
[]
["Project Name",null,null,{"$f":"IF(+Targeting!B5=\"\",\"\",+Targeting!B5)","v":""},null,"Total Units",null,{"$f":"Targeting!A45","v":""},"Project Based Rental Subsidy (Indicate \"Yes\" or \"No\")",null,null,null,null,null,null,"If Yes, what is the status?"]
[null,null,null,null,null,null,null,null,null,null,null,null,null,null,null,null,null,null,null,null,null,null,null,null,null,null,null,null,null,"Column1"]
["Income Assumptions",null,null,"Rate of Increase",null,"Year 1","Year 2","Year 3","Year 4","Year 5","Year 6","Year 7","Year 8","Year 9","Year 10","Year 11","Year 12","Year 13","Year 14","Year 15","Year 1 Pct of Total Expenses",null,null,null,null,null,null,null,null,"Yes"]
["Gross Residential Rents-Restricted Income Units",null,null,null,null,{"$f":"IF(+Targeting!M40=\"\",0,+Targeting!M40)","v":0},{"$f":"(F7*$E$6)+F7","v":0},{"$f":"(G7*$E$6)+G7","v":0},0,0,0,0,0,0,0,0,0,0,0,0,null,null,null,null,null,null,null,null,null,"No"]
["Gross Residential Rents-Restricted Income Units Subsidy",null,null,null,null,{"$f":"IF(+Targeting!L40=\"\",0,+Targeting!L40)","v":0},{"$f":"(F8*$E$6)+F8","v":0},{"$f":"(G8*$E$6)+G8","v":0},0,0,0,0,0,0,0,0,0,0,0,0]
["Gross Residential Rents-Non-restricted Income Units",null,null,null,null,0,{"$f":"(F9*$E$6)+F9","v":0},0,0,0,0,0,0,0,0,0,0,0,0,0,null,null,null,null,null,null,null,null,null,"Status of Project Based Rental Subsidy Commitment"]
["   Less Vacancy ",null,null,"% of Gross Rents =",null,{"$f":"((F7+F8+F9)*$E$10)*-1","v":0},{"$f":"((G7+G8+G9)*$E$10)*-1","v":0},0,0,0,0,0,0,0,0,0,0,0,0,0,null,null,null,null,null,null,null,null,null,"Approved"]
{"$rows_left_out":39}
{"sheet":"15-Year Commercial Op Pro Forma","index":5,"n_rows":41,"n_cols":24,"rows_kept":41,"cut":false,"hidden":false,"merged":[[5,0,5,2],[6,0,6,4],[0,0,0,19],[1,0,1,19],[3,0,3,2],[3,3,3,4],[3,5,3,6],[3,8,3,15],[3,17,3,18],[7,0,7,2],[8,0,8,1],[8,2,8,4],[9,0,9,1],[9,2,9,4],[22,0,22,4],[10,0,10,4],[12,0,12,2],[13,0,13,2],[14,0,14,4],[15,0,15,4],[16,0,16,4],[17,0,17,4],[18,0,18,4],[19,0,19,4],[20,0,20,4],[21,0,21,4],[30,0,30,2],[23,0,23,2],[24,0,24,2],[25,0,25,4],[26,0,26,4],[27,0,27,1],[27,2,27,4],[28,0,28,1],[28,2,28,4],[29,2,29,4],[31,0,31,4],[32,0,32,4],[33,0,33,4],[34,0,34,4],[35,0,35,2],[35,3,35,4],[39,0,39,2],[39,3,39,4],[40,0,40,4],[36,0,36,2],[36,3,36,4],[37,0,37,2],[37,3,37,4],[38,0,38,2],[38,3,38,4]]}
["Rental Projects: 15-Year Commercial Operating Pro Forma"]
[{"$f":"'Sources & Uses of Funds'!A2","v":"Version 5.1 Updated 1/26/21"}]
[]
["Project Name",null,null,{"$f":"IF(+Targeting!B5=\"\",\"\",+Targeting!B5)","v":""},null,"Total Units",null,{"$f":"Targeting!A45","v":""},"Did your permanent lender include commercial income in their underwriting?",null,null,null,null,null,null,null,null,"Triple Net Lease?"]
[]
["Income Assumptions",null,null,"Rate of Increase",null,"Year 1","Year 2","Year 3","Year 4","Year 5","Year 6","Year 7","Year 8","Year 9","Year 10","Year 11","Year 12","Year 13","Year 14","Year 15","Pct of Year 1 Total Expenses"]
["Scheduled Commercial Rents",null,null,null,null,null,{"$f":"(F7*$E$6)+F7","v":0},{"$f":"(G7*$E$6)+G7","v":0},{"$f":"(H7*$E$6)+H7","v":0},0,0,0,0,0,0,0,0,0,0,0,null,null,null,"Yes"]
["   Less Vacancy ",null,null,"% of Gross Rents =",null,{"$f":"(F7*$E$8)*-1","v":0},{"$f":"(G7*$E$8)*-1","v":0},{"$f":"(H7*$E$8)*-1","v":0},0,0,0,0,0,0,0,0,0,0,0,0,null,null,null,"No"]
["Other",null,null,null,null,null,{"$f":"(F9*$E$6)+F9","v":0},{"$f":"(G9*$E$6)+G9","v":0},0,0,0,0,0,0,0,0,0,0,0,0,null,null,null,"N/A"]
["Other",null,null,null,null,null,{"$f":"(F10*$E$6)+F10","v":0},0,0,0,0,0,0,0,0,0,0,0,0,0]
{"$rows_left_out":32}
{"sheet":"Empowerment Budget","index":6,"n_rows":27,"n_cols":7,"rows_kept":27,"cut":false,"hidden":false,"merged":[[25,5,25,7],[26,5,26,7],[12,0,12,3],[25,0,25,3],[26,0,26,3],[15,5,15,7],[16,5,16,7],[17,5,17,7],[18,5,18,7],[19,5,19,7],[20,5,20,7],[21,5,21,7],[22,5,22,7],[23,5,23,7],[24,5,24,7],[20,0,20,3],[22,0,22,3],[23,0,23,3],[24,0,24,3],[15,0,15,3],[16,0,16,3],[17,0,17,3],[18,0,18,3],[19,0,19,3],[3,4,3,5],[3,0,3,2],[0,0,0,7],[1,0,1,7],[21,0,21,3],[11,0,11,3],[14,0,14,3],[12,5,12,7],[6,5,6,7],[5,5,5,7],[7,5,7,7],[8,5,8,7],[9,5,9,7],[10,5,10,7],[11,5,11,7],[6,0,6,3],[7,0,7,3],[8,0,8,3],[9,0,9,3],[10,0,10,3],[5,0,5,3]]}
["Rental Projects: Promotion of Empowerment Budget"]
[{"$f":"'Sources & Uses of Funds'!A2","v":"Version 5.1 Updated 1/26/21"}]
[]
["Project Name",null,null,{"$f":"IF(+Targeting!B5=\"\",\"\",+Targeting!B5)","v":""},"Total Units",null,{"$f":"Targeting!A45","v":""}]
[]
["Source of Revenue",null,null,null,"Year 1","Notes"]
[]
[]
[]
[]
{"$rows_left_out":18}
{"sheet":"Benchmarks","index":7,"n_rows":44,"n_cols":6,"rows_kept":44,"cut":false,"hidden":false,"merged":[[23,4,26,4],[23,5,26,5],[16,0,17,0],[18,5,19,5],[11,1,14,1],[11,4,14,4],[23,0,26,0],[23,1,26,1],[23,3,24,3],[25,3,26,3],[15,2,15,3],[0,0,0,5],[1,0,1,5],[18,2,19,2],[18,3,19,3],[18,4,19,4],[11,0,14,0],[8,0,9,0],[8,2,9,4],[8,5,9,5],[11,5,14,5],[16,1,17,1],[16,2,17,2],[16,4,17,4],[16,5,17,5],[3,1,3,2],[35,5,36,5],[38,2,38,3],[33,0,34,0],[33,2,34,2],[33,4,34,4],[33,5,34,5],[39,2,39,4],[35,0,36,0],[35,1,36,1],[35,2,36,2],[35,4,36,4]]}
["Rental Projects: Benchmarks"]
[{"$f":"Targeting!A2:M2","v":"Version 5.1 Updated 1/26/21"}]
[]
["Project Name",{"$f":"IF(+Targeting!B5=\"\",\"\",+Targeting!B5)","v":""},null,"Total Units",{"$f":"'15-Year Op Pro Forma'!H4","v":""}]
[]
["Criterion","Per Schedules","Feasibility Benchmark","Oversubsidization Benchmark","Within Benchmarks?","Provide detailed explanations and supporting documentation for all benchmark deviations. Deviation explanations must be quantifiable in relation to the amount the benchmark is exceeded. Third-party supporting documentation is preferred."]
[]
["Development Budget"]
["Construction costs per square foot (excluding land costs and soft costs) ",{"$f":"IF('Sources & Uses of Funds'!C8=\"\",\"\",'Sources & Uses of Funds'!C8)","v":""},"To ensure consistent and reasonable cost assumptions, the per square foot construction cost should not be greater than the gross residential square footage cost estimates provided by the RSMeans Company and included in the application Reference Guide. \nCalculation takes total new construction or rehab costs minus environmental remediation and hard cost contingency, and divides it by total residential square footage. Off-site work, environmental remediation, and hard cost continency line items cannot be used to explain benchmark deviation."]
[null,{"$f":"IF('Sources & Uses of Funds'!D92=0,0,(('Sources & Uses of Funds'!D28-'Sources & Uses of Funds'!D26-'Sources & Uses of Funds'!D27)/'Sources & Uses of Funds'!L4))","v":0}]
{"$rows_left_out":35}
{"sheet":"Targeting Self-Score","index":8,"n_rows":30,"n_cols":7,"rows_kept":30,"cut":false,"hidden":false,"merged":[[0,0,0,6],[1,0,1,6],[25,0,25,1],[19,0,19,1],[20,0,20,1],[21,0,21,1],[24,0,24,1],[12,3,12,5],[13,3,13,5],[14,3,14,5],[15,3,15,5],[16,3,16,5],[26,0,26,1],[27,0,27,1],[28,0,28,1],[29,0,29,1],[18,0,18,1],[23,0,23,1]]}
["Rental Projects: Targeting Self-Score"]
[{"$f":"Targeting!A2:M2","v":"Version 5.1 Updated 1/26/21"}]
[]
["Project Name",{"$f":"IF(+Targeting!B5=\"\",\"\",+Targeting!B5)","v":""},"Proposed No. of Units","Proposed AMI Targets","Proposed No. of Units @ 50% AMI or less","Proposed No. of Units  >50% & <=80% AMI","WAAMIT Calc"]
[null,null,{"$f":"+Targeting!R40","v":0},0.5,{"$f":"IF(D5=\"\",0,IF(D5<=0.5,C5,0))","v":0},{"$f":"IF(D5>0.5,C5,0)","v":0},{"$f":"IF(D5>0.5,C5*D5,0)","v":0}]
[null,null,{"$f":"Targeting!S40","v":0},null,0,0,0]
["Note:",null,{"$f":"+Targeting!T40","v":0},null,0,0,0]
["1. No additional points given for units targeted",null,{"$f":"+Targeting!U40","v":0},null,0,0,0]
["below 50% AMI.",null,{"$f":"+Targeting!V40","v":0},null,0,0,0]
[null,null,{"$f":"+Targeting!W40","v":0},null,0,0,0]
{"$rows_left_out":21}
{"sheet":"Subsidy Per Unit Score","index":9,"n_rows":18,"n_cols":5,"rows_kept":18,"cut":false,"hidden":true,"merged":[[6,0,6,2],[4,0,4,1],[4,2,4,4],[0,0,0,4],[1,0,1,4],[7,0,7,2],[8,0,8,2],[9,0,9,2],[10,0,10,2],[17,1,17,2],[12,1,12,2],[13,1,13,2],[14,1,14,2],[15,1,15,2]]}
["Rental Projects: Subsidy Per Unit Score"]
[{"$f":"Targeting!A2:M2","v":"Version 5.1 Updated 1/26/21"}]
[]
[]
["Project Name",null,{"$f":"IF(+Targeting!B5=\"\",\"\",+Targeting!B5)","v":""}]
[]
["Subsidy Requested",null,null,{"$f":"IF('Sources & Uses of Funds'!E94=0,0,'Sources & Uses of Funds'!E94)","v":0},"Line 1"]
["AHP Project Units (income restricted units)",null,null,{"$f":"IF(Targeting!A40=\"\",0,Targeting!A40)","v":0},"Line 2"]
["Subsidy per Unit (line 1 divided by line 2)",null,null,{"$f":"IF(D7=0,0,D7/D8)","v":0},"Line 3"]
["High End of Rental Project Subsidy per Unit Range",null,null,40000,"Line 4"]
{"$rows_left_out":9}
{"sheet":"Households Requiring Lg. Units","index":10,"n_rows":13,"n_cols":4,"rows_kept":13,"cut":false,"hidden":true,"merged":[[12,1,12,2],[7,0,7,2],[8,0,8,2],[10,1,10,2],[0,0,0,3],[1,0,1,3],[4,0,4,1],[4,2,4,3],[6,0,6,2]]}
["Rental Projects: Housing for Large Units Score"]
[{"$f":"Targeting!A2:M2","v":"Version 5.1 Updated 1/26/21"}]
[]
[]
["Project Name",null,{"$f":"IF(+Targeting!B5=\"\",\"\",+Targeting!B5)","v":""}]
[]
["AHP Project Total Units ",null,null,{"$f":"IF(Targeting!A50=\"\",0,Targeting!A45)","v":0}]
["Units with 3+ bedrooms",null,null,{"$f":"IF(Targeting!A51=\"\",0,Targeting!A51)","v":0}]
["Percentage of Units with 3+ Bedrooms",null,null,{"$f":"D8/D7","v":{"$error":"#DIV/0!"}}]
[]
{"$rows_left_out":4}
{"sheet":"AHP Application Comparison","index":11,"n_rows":42,"n_cols":13,"rows_kept":42,"cut":false,"hidden":false,"merged":[[4,1,4,7]]}
[null,null,null,null,null,null,null,null,"AHP Application Comparison",null,null,"Hidden to prevent data entry; field needs to be unlocked for macro to update"]
[null,null,null,null,null,null,null,null,{"$f":"Targeting!A2","v":"Version 5.1 Updated 1/26/21"},null,null,"Status (Unlocked)","Not Yet Compared"]
[null,null,null,null,null,null,null,null,null,null,null,"Field Text Default","Not Yet Compared"]
[null,"Instructions"]
[null,"Click the \"Run Comparison Now\" button below to validate that the below referenced fields have matching values between the project's AHP Application and this Rental AHP Application Financial Workbook."]
[]
[null,"Comparison Last Executed",{"$f":"COMPARISON_LAST_RUN","v":"Not Yet Compared"}]
[]
[null,"Field","Financial Workbook Value","EFORM_FIELD_NAME","EFORM_VALUE_IF_BLANK","EFORM_FIELD_VALUE","AHP Application Value","Match?"]
[null,"Direct Subsidy Requested",{"$f":"IF('Sources & Uses of Funds'!E94=\"\",0,'Sources & Uses of Funds'!E94)","v":0},"DIR_SUB_AMT",0,null,{"$f":"IF(F10=\"\",\"\",F10)","v":""},{"$f":"IF(I10=\"\",\"\",IF(IFERROR(DATEVALUE(TEXT(COMPARISON_LAST_RUN,\"mm/dd/yyy\")),0)<=0,COMPARISON_DEFAULT_STATUS,IF(I10=2,\"Yes\",\"No\")))","v":"Not Yet Compared"},{"$f":"IF(C10=\"\",\"\",IF(IFERROR(DATEVALUE(TEXT(COMPARISON_LAST_RUN,\"mm/dd/yyy\")),0)<=0,1,IF(IF(ISBLANK(C10),0,C10)=IF(ISBLANK(G10),0,G10),2,0)))","v":1}]
{"$rows_left_out":33}
{"sheet":"Data Import Summary","index":12,"n_rows":46,"n_cols":15,"rows_kept":46,"cut":false,"hidden":true,"merged":[]}
["IRIS Tab","Question","ID ","Financial Workbook Worksheet","Cell","Additional field name details","Type","Required ","Validation","Export?","Link to Workbook","DB Field Name / \nDynamic Framework Question ID","DB Field Type  ","Dynamic Framework TABLE.COLUMN_NAME","Additional Notes"]
["Basic Review","Sources = Uses",null,"Sources & Uses of Funds","O94",null,"Number","Y","If cell =0 then \"Yes\",  if not equal to zero then \"No\".","Yes",{"$f":"IF('Sources & Uses of Funds'!$O$94=0,1,0)","v":1}]
["Basic Review","Cash Flow",null,"15-Year Op Pro Forma","F48:T48",null,"Number","Y","If sum of cells is >=0 then \"Yes\", if not then \"No\".","Yes",{"$f":"SUM('15-Year Op Pro Forma'!F48:T48)","v":0}]
["Basic Review","20% VLI",null,"Targeting Worksheet","A46",null,"Percentage","Y","If cell is >=20% then \"Yes\", if not then \"No\".","Yes",{"$f":"Targeting!$A$46","v":""}]
["Sources of Funds","HOME",null,"Sources of Funds Summary","A11",null,"Drop-down ( Yes, No)","N, but one cell must say \"Yes\". ","If cell = \"Yes\" then check, if other value, then blank. ","Yes if cell = \"Yes\"",{"$f":"'Sources of Funds Summary'!$A$11","v":0}]
["Sources of Funds","CDBG",null,"Sources of Funds Summary","A12",null,"Drop-down ( Yes, No)","N, but one cell must say \"Yes\". ","If cell = \"Yes\" then check, if other value, then blank. ","Yes if cell = \"Yes\"",{"$f":"'Sources of Funds Summary'!$A$12","v":0}]
["Sources of Funds","FHA",null,"Sources of Funds Summary","A13",null,"Drop-down ( Yes, No)","N, but one cell must say \"Yes\". ","If cell = \"Yes\" then check, if other value, then blank. ","Yes if cell = \"Yes\"",{"$f":"'Sources of Funds Summary'!$A$13","v":0}]
["Sources of Funds","LIHTC",null,"Sources of Funds Summary","A14",null,"Drop-down ( Yes, No)","N, but one cell must say \"Yes\". ","If cell = \"Yes\" then check, if other value, then blank. ","Yes if cell = \"Yes\"",{"$f":"'Sources of Funds Summary'!$A$14","v":0}]
["Sources of Funds","Other Federal Housing",null,"Sources of Funds Summary","A15",null,"Drop-down ( Yes, No)","N, but one cell must say \"Yes\". ","If cell = \"Yes\" then check, if other value, then blank. ","Yes if cell = \"Yes\"",{"$f":"'Sources of Funds Summary'!$A$15","v":0}]
["Sources of Funds","Tax Exempt",null,"Sources of Funds Summary","A16",null,"Drop-down ( Yes, No)","N, but one cell must say \"Yes\". ","If cell = \"Yes\" then check, if other value, then blank. ","Yes if cell = \"Yes\"",{"$f":"'Sources of Funds Summary'!$A$16","v":0}]
{"$rows_left_out":37}
{"sheet":"Version Control","index":13,"n_rows":50,"n_cols":6,"rows_kept":50,"cut":false,"hidden":true,"merged":[]}
["AHP Application Financial Workbook Changes Log"]
[]
["Updated","2020-12-30"]
["By","Rose Wirtz"]
[]
[]
["Financial Workbook","Version","Tab","Description of Change from Previous Version","Completed by, date","Approver"]
["Rental",5,"All tabs","New FHLBSF logo and version number (5.0)"]
["Rental",5,"Targeting","Locked Homeless, Special Needs, and Bedrooms per Unit cells so only other acceptable input than the drop-down choices is 0"]
["Rental",5,"Sources & Uses of Funds","Added \"Pct of Funds\" column for easier analysis by feasbility analyst "]
{"$rows_left_out":40}