{"text_format":"1","workbook":"xlsx","n_sheets":13,"sheets":["Workbook Instructions and Notes","Targeting & Financing Sources","Sources of Funds Summary","Development Budget","Discounted Financing","Empowerment Budget","Benchmarks","Targeting Score","Subsidy Per Unit Score","Households Requiring Lg. Units","AHP Application Comparison","Data Import Summary","Version Control"],"not_rendered":{"charts":0,"images":1,"macros":1,"external_links":2,"defined_names":38,"comments":2,"pivot_tables":0},"unopened":[],"bounds":{"document_bytes":16777216,"sheet_cells":100000,"rows_first":2000,"rows_last":500,"rows_between":2000,"halvings":0,"cell_chars":16384,"cell_head_chars":4096},"cells_cut":0,"cells_raw":0,"read":"whole","date_system":"1900"}

{"sheet":"Workbook Instructions and Notes","index":0,"n_rows":49,"n_cols":2,"rows_kept":49,"cut":false,"hidden":false,"merged":[]}
[null,"Owner-Occupied AHP Application Financial Workbook"]
[null,{"$f":"'Targeting & Financing Sources'!A2","v":"Version 5.1 Updated 1/26/21"}]
[]
["General Instructions and Notes"]
["1.","All shaded cells are protected and cannot be altered."]
["2.","Complete all worksheets sequentially."]
["Targeting & Financing Sources Worksheet"]
["1.","Enter the current 50% (very-low) AMI, adjusted for family size, based on the HUD income limit guidelines."]
["2.","Enter the targeted AMI for each unit type, (i.e. 50%, 60% etc.)"]
["3.","If sponsor is providing discounted financing, (i.e. zero % mortgages), select \"Y\" in the box and complete the Discounted Financing  worksheet."]
{"$rows_left_out":40}
{"sheet":"Targeting & Financing Sources","index":1,"n_rows":85,"n_cols":38,"rows_kept":85,"cut":false,"hidden":false,"merged":[[56,15,57,15],[56,16,57,19],[12,24,13,26],[12,3,12,4],[13,3,13,4],[15,3,15,4],[16,18,16,19],[50,15,51,15],[50,16,51,19],[9,8,12,8],[10,11,12,11],[10,12,12,12],[19,10,21,10],[19,11,21,11],[10,9,12,9],[10,10,12,10],[0,0,0,19],[1,0,1,19],[5,1,5,2],[5,18,5,19],[5,14,5,17],[5,3,5,6],[22,0,48,0],[16,3,16,4],[10,1,10,2],[12,1,12,2],[14,3,14,4],[11,1,11,2],[50,1,50,12],[16,14,16,17],[14,14,14,18],[12,14,12,18],[13,14,13,18],[19,9,21,9],[10,18,10,19],[10,14,10,17],[8,3,8,4],[8,14,8,17],[9,14,9,17],[10,5,10,6],[6,1,6,2],[6,3,6,6],[8,9,8,12],[8,1,8,2],[9,1,9,2],[7,1,7,6],[9,5,9,6],[6,18,6,19],[7,18,7,19],[8,18,8,19],[9,18,9,19],[6,14,6,17],[7,14,7,17],[11,5,11,6],[12,5,12,6],[9,3,9,4],[10,3,10,4],[11,3,11,4],[52,15,53,15],[52,16,53,19],[54,15,55,15],[54,16,55,19],[8,5,8,6],[13,5,13,6],[18,6,21,6],[14,5,14,6],[15,5,15,6],[16,5,16,6],[48,2,48,6],[13,1,13,2],[14,1,14,2],[16,1,16,2],[15,1,15,2],[19,12,21,12]]}
["Owner-Occupied Projects: Targeting & Financing Sources"]
["Version 5.1 Updated 1/26/21"]
[]
[null,"Note: Attach copy of page from HUD statistics showing AMIs for this PMSA/MSA"]
[]
[null,"Project Name",null,null,null,null,null,null,null,null,null,null,"Per unit",null,"Actual AMI Ratios",null,null,null,"Proposed"]
[null,"PMSA",null,null,null,null,null,null,null,"AHP Subsidy Requested",null,{"$f":"+H49","v":""},{"$f":"IF(S11=0,\"\",+L7/S11)","v":""},null,"Units with AMI ratio of 65% or less",null,null,null,{"$f":"IF(SUM(X24:X48)=\"\",\"\",SUM(X24:X48))","v":""}]
[null,"HUD - 2021 Income Limits (if unavailable, use 2020)",null,null,null,null,null,null,null,null,null,null,null,null,"Units with AMI ratio over 65% and up to 70%",null,null,null,{"$f":"IF(SUM(Y24:Y48)=\"\",\"\",SUM(Y24:Y48))","v":""}]
[null,"50% AMI",null,"100% AMI",null,"Family Size",null,null,null,"Financing Sources",null,null,null,null,"Units with AMI ratio over 70% and up to 75%",null,null,null,{"$f":"IF(SUM(Z24:Z48)=\"\",\"\",SUM(Z24:Z48))","v":""}]
[null,null,null,{"$f":"IF(B10=\"\",\"\",B10*2)","v":""},null,"1 person",null,null,null,"(1)","(2)","(3)","(4)",null,"Units with AMI ratio over 75% and up to 80%",null,null,null,{"$f":"IF(SUM(AA24:AA48)=\"\",\"\",SUM(AA24:AA48))","v":""},null,null,null,null,null,null,"Per Unit"]
{"$rows_left_out":76}
{"sheet":"Sources of Funds Summary","index":2,"n_rows":23,"n_cols":11,"rows_kept":23,"cut":false,"hidden":false,"merged":[[20,1,20,3],[8,1,9,3],[13,1,13,3],[14,1,14,3],[16,1,16,3],[19,1,19,3],[17,1,17,3],[0,0,0,3],[1,0,1,3],[7,0,7,3],[5,0,6,3],[18,1,18,3],[4,1,4,3],[15,1,15,3],[8,0,9,0],[10,1,10,3],[11,1,11,3],[12,1,12,3]]}
["Owner-Occupied Projects: Sources of Funds Summary"]
[{"$f":"'Targeting & Financing Sources'!A2:T2","v":"Version 5.1 Updated 1/26/21"}]
[]
[]
["Project Name",{"$f":"IF('Targeting & Financing Sources'!D6=\"\",\"\",'Targeting & Financing Sources'!D6)","v":""}]
["Please provide the required information below."]
[]
["Project Financing Sources* "]
["Select             \"Yes\" or \"No\"","Does the project intend to utilize funding from the following:"]
[null,null,null,null,null,null,null,null,null,null,"Response"]
{"$rows_left_out":14}
{"sheet":"Development Budget","index":3,"n_rows":52,"n_cols":11,"rows_kept":52,"cut":false,"hidden":false,"merged":[[49,1,49,3],[51,1,52,5],[53,1,53,5],[15,2,15,3],[16,1,16,3],[19,1,19,3],[20,1,20,3],[21,1,21,3],[24,1,24,3],[45,1,45,3],[47,1,47,3],[18,1,18,3],[37,1,37,3],[43,1,43,3],[29,1,29,3],[42,1,42,3],[0,0,0,5],[1,0,1,5],[11,1,11,3],[12,1,12,3],[30,1,30,3],[13,1,13,3],[14,2,14,3],[3,2,3,3],[10,1,10,3],[7,1,7,3],[9,1,9,3],[5,2,5,3],[31,1,31,3],[32,1,32,3],[28,1,28,3],[25,1,25,3],[22,1,22,3],[23,1,23,3],[26,1,26,3],[27,1,27,3],[39,2,39,3],[40,2,40,3],[41,2,41,3],[33,1,33,3],[34,1,34,3],[36,1,36,3],[35,1,35,3],[38,2,38,3]]}
["Owner-Occupied Projects: Development Budget"]
[{"$f":"'Targeting & Financing Sources'!A2:T2","v":"Version 5.1 Updated 1/26/21"}]
[]
[null,"Project Name",{"$f":"IF('Targeting & Financing Sources'!D6=\"\",\"\",'Targeting & Financing Sources'!D6)","v":""},null,"Number of Homes",{"$f":"IF('Targeting & Financing Sources'!B49=0,\"\",'Targeting & Financing Sources'!B49)","v":""}]
[]
[null,"Building Type"]
[null,null,null,null,"Total","Per Home","Pct of Budget"]
[null,"Average Square Footage",null,null,{"$f":"IF(F4=\"\",\"\",F4*F8)","v":""},null,null,null,null,null,"Condos"]
[null,null,null,null,null,null,null,null,null,null,"Single Family Homes"]
[null,"Acquisition Costs",null,null,null,null,null,null,null,null,"Townhomes"]
{"$rows_left_out":43}
{"sheet":"Discounted Financing","index":4,"n_rows":33,"n_cols":5,"rows_kept":33,"cut":false,"hidden":false,"merged":[[0,0,0,4],[1,0,1,4],[16,0,16,3],[28,0,28,3],[5,1,5,3],[26,1,26,3],[14,0,14,3],[25,1,25,3],[10,0,10,3],[7,0,7,1],[3,0,3,4],[15,0,15,3],[13,0,13,3],[12,0,12,3],[11,0,11,3],[33,0,40,4],[18,0,18,3],[20,0,20,3],[30,0,30,3],[22,0,22,3],[27,1,27,3]]}
["Owner-Occupied Projects: Discounted Financing Calculation"]
[{"$f":"'Targeting & Financing Sources'!A2","v":"Version 5.1 Updated 1/26/21"}]
[]
["This Worksheet is to be completed by sponsors providing discounted financing to homebuyers as indicated on the Targeting & Financing Sources Worksheet."]
[]
["Project Name",{"$f":"IF('Targeting & Financing Sources'!D6=\"\",\"\",'Targeting & Financing Sources'!D6)","v":""}]
[]
["Is Sponsor Providing Discounted Financing?",null,{"$f":"IF('Targeting & Financing Sources'!T14=\"Y\", \"Yes\", \"No\")","v":"No"}]
[]
["Sponsor's Discounted Financing"]
{"$rows_left_out":24}
{"sheet":"Empowerment Budget","index":5,"n_rows":27,"n_cols":7,"rows_kept":27,"cut":false,"hidden":false,"merged":[[26,0,26,3],[26,5,26,7],[23,0,23,3],[23,5,23,7],[24,0,24,3],[24,5,24,7],[25,0,25,3],[25,5,25,7],[20,0,20,3],[20,5,20,7],[21,0,21,3],[21,5,21,7],[22,0,22,3],[22,5,22,7],[17,0,17,3],[17,5,17,7],[18,0,18,3],[18,5,18,7],[19,0,19,3],[19,5,19,7],[16,0,16,3],[16,5,16,7],[9,0,9,3],[9,5,9,7],[10,0,10,3],[10,5,10,7],[11,0,11,3],[11,5,11,7],[12,0,12,3],[12,5,12,7],[14,0,14,3],[15,0,15,3],[15,5,15,7],[6,0,6,3],[6,5,6,7],[7,0,7,3],[7,5,7,7],[8,0,8,3],[8,5,8,7],[0,0,0,7],[1,0,1,7],[3,0,3,2],[3,4,3,5],[5,0,5,3],[5,5,5,7]]}
["Owner-Occupied Projects: Promotion of Empowerment Budget"]
[{"$f":"'Targeting & Financing Sources'!A2:T2","v":"Version 5.1 Updated 1/26/21"}]
[]
["Project Name",null,null,{"$f":"'Targeting & Financing Sources'!D6:G6","v":0},"Total Units",null,{"$f":"'Targeting & Financing Sources'!B49","v":""}]
[]
["Source of Revenue",null,null,null,"Amount","Notes"]
[]
[]
[]
[]
{"$rows_left_out":18}
{"sheet":"Benchmarks","index":6,"n_rows":14,"n_cols":7,"rows_kept":14,"cut":false,"hidden":false,"merged":[[12,2,12,4],[11,2,11,3],[0,0,0,6],[8,5,10,5],[8,6,10,6],[3,1,3,3],[8,2,10,2],[6,0,7,0],[6,2,7,4],[6,5,7,5],[6,6,7,6],[1,0,1,6],[8,4,10,4],[9,0,10,0],[9,1,10,1]]}
["Owner-Occupied Projects: Benchmarks"]
[{"$f":"'Development Budget'!A2:H2","v":"Version 5.1 Updated 1/26/21"}]
[]
["Project Name",{"$f":"IF('Targeting & Financing Sources'!D6=\"\",\"\",'Targeting & Financing Sources'!D6)","v":""}]
[]
["Criterion","Per Schedules","Feasibility Benchmark","Oversubsidization Benchmark","Within Benchmarks?","Provide detailed explanations and supporting documentation for all benchmark deviations. Deviation explanations must be quantifiable in relation to the amount the benchmark is exceeded.  Third party supporting documentation is preferred.","Check"]
["Construction costs per square foot (excluding land costs and soft costs)",{"$f":"IF('Development Budget'!C6=\"\",\"\",'Development Budget'!C6)","v":""},"To ensure consistent and reasonable cost assumptions, the per square foot construction cost should not be greater than the gross residential square footage cost estimates provided by the RSMeans Company and included in the application package."]
[null,{"$f":"IFERROR(IF('Development Budget'!F44=0,0,('Development Budget'!F25+'Development Budget'!F26+'Development Budget'!F28)/'Development Budget'!F8),\"\")","v":0}]
["Total developer fee",{"$f":"IF('Development Budget'!E43=\"\",\"$0\",IF('Development Budget'!E43=0,\"\",'Development Budget'!E43))","v":"$0"},"$0","Not greater than",{"$f":"IF(B10=\"\",\"Yes\",IF(B10>=D10,\"No\",\"Yes\"))","v":"Yes"}]
["Total developer fee as percentage of total development cost",{"$f":"IF('Development Budget'!E46=0,0,('Development Budget'!E43/'Development Budget'!E46))","v":0},null,0.12]
{"$rows_left_out":5}
{"sheet":"Targeting Score","index":7,"n_rows":14,"n_cols":4,"rows_kept":14,"cut":false,"hidden":false,"merged":[[13,3,13,4],[13,0,13,2],[3,1,3,4],[0,0,0,4],[1,0,1,4],[11,0,11,4]]}
["Owner-Occupied Projects: Targeting Score"]
[{"$f":"'Sources of Funds Summary'!A2:G2","v":"Version 5.1 Updated 1/26/21"}]
[]
["Project Name",{"$f":"IF('Targeting & Financing Sources'!D6=\"\",\"\",'Targeting & Financing Sources'!D6)","v":""}]
[]
[]
["Actual Area Median Income Ratios","Proposed No. of Units","% of Total Units"]
["Units with AMI ratio at or below 65%",{"$f":"IF('Targeting & Financing Sources'!S7=\"\",\"\",'Targeting & Financing Sources'!S7)","v":""},{"$f":"IF(B8=\"\",\"\",B8/B10)","v":""}]
["Units with AMI ratio of greater than 65%",{"$f":"IF(SUM('Targeting & Financing Sources'!S8:S10)=\"\",\"\",SUM('Targeting & Financing Sources'!S8:S10))","v":0},{"$f":"IFERROR(IF(B9=\"\",\"\",B9/B10),\"\")","v":""}]
["Total Units",{"$f":"IF('Targeting & Financing Sources'!S11=\"\",\"\",'Targeting & Financing Sources'!S11)","v":""}]
{"$rows_left_out":5}
{"sheet":"Subsidy Per Unit Score","index":8,"n_rows":18,"n_cols":5,"rows_kept":18,"cut":false,"hidden":true,"merged":[[8,0,8,2],[9,0,9,2],[10,0,10,2],[17,1,17,2],[12,1,12,2],[13,1,13,2],[14,1,14,2],[15,1,15,2],[7,0,7,2],[4,0,4,1],[6,0,6,2],[4,2,4,4],[0,0,0,4],[1,0,1,4]]}
["Owner-Occupied Projects: Subsidy Per Unit Score"]
[{"$f":"'Targeting & Financing Sources'!A2:T2","v":"Version 5.1 Updated 1/26/21"}]
[]
[]
["Project Name",null,{"$f":"IF(+'Targeting & Financing Sources'!D6=\"\",\"\",+'Targeting & Financing Sources'!D6)","v":""}]
[]
["Subsidy Requested",null,null,{"$f":"IF('Targeting & Financing Sources'!L7=\"\",0,'Targeting & Financing Sources'!L7)","v":0},"Line 1"]
["AHP Project Units (income restricted units)",null,null,{"$f":"IF('Targeting & Financing Sources'!S11=\"\",0,'Targeting & Financing Sources'!S11)","v":0},"Line 2"]
["Subsidy per Unit (line 1 divided by line 2)",null,null,{"$f":"IF(D7=0,0,D7/D8)","v":0},"Line 3"]
["High End of Owner-Occupied Project Subsidy per Unit Range",null,null,45000,"Line 4"]
{"$rows_left_out":9}
{"sheet":"Households Requiring Lg. Units","index":9,"n_rows":13,"n_cols":4,"rows_kept":13,"cut":false,"hidden":true,"merged":[[8,0,8,2],[10,1,10,2],[12,1,12,2],[0,0,0,3],[1,0,1,3],[4,0,4,1],[4,2,4,3],[6,0,6,2],[7,0,7,2]]}
["Owner-Occupied Projects: Housing for Large Units Score"]
[{"$f":"'Sources of Funds Summary'!A2:G2","v":"Version 5.1 Updated 1/26/21"}]
[]
[]
["Project Name",null,{"$f":"IF(+'Targeting & Financing Sources'!D6=\"\",\"\",+'Targeting & Financing Sources'!D6)","v":""}]
[]
["AHP Project Total Units ",null,null,{"$f":"IF('Targeting & Financing Sources'!B49=0,\"\",'Targeting & Financing Sources'!B49)","v":""}]
["Units with 3+ bedrooms",null,null,{"$f":"SUMIF('Targeting & Financing Sources'!C24:C48,\">=3\",'Targeting & Financing Sources'!B24:B48)","v":0}]
["Percentage of Units with 3+ Bedrooms",null,null,{"$f":"D8/D7","v":{"$error":"#VALUE!"}}]
[]
{"$rows_left_out":4}
{"sheet":"AHP Application Comparison","index":10,"n_rows":14,"n_cols":13,"rows_kept":14,"cut":false,"hidden":false,"merged":[[4,1,4,7]]}
[null,null,null,null,null,null,null,null,"AHP Application Comparison",null,null,"Hidden to prevent data entry; field needs to be unlocked for macro to update"]
[null,null,null,null,null,null,null,null,{"$f":"'Targeting & Financing Sources'!A2","v":"Version 5.1 Updated 1/26/21"},null,null,"Status (Unlocked)","Not Yet Compared"]
[null,null,null,null,null,null,null,null,null,null,null,"Field Text Default","Not Yet Compared"]
[null,"Instructions"]
[null,"Click the \"Run Comparison Now\" button below to validate that the below referenced fields have matching values between the project's AHP Application and this Owner-Occupied AHP Application Financial Workbook."]
[]
[null,"Comparison Last Executed",{"$f":"COMPARISON_LAST_RUN","v":"Not Yet Compared"}]
[]
[null,"Field","Financial Workbook Value","EFORM_FIELD_NAME","EFORM_VALUE_IF_BLANK","EFORM_FIELD_VALUE","AHP Application Value","Match?"]
[null,"Direct Subsidy Requested",{"$f":"IF('Targeting & Financing Sources'!H49=\"\",0,'Targeting & Financing Sources'!H49)","v":0},"DIR_SUB_AMT",0,null,{"$f":"IF(F10=\"\",\"\",F10)","v":""},{"$f":"IF(I10=\"\",\"\",IF(IFERROR(DATEVALUE(TEXT(COMPARISON_LAST_RUN,\"mm/dd/yyy\")),0)<=0,COMPARISON_DEFAULT_STATUS,IF(I10=2,\"Yes\",\"No\")))","v":"Not Yet Compared"},{"$f":"IF(C10=\"\",\"\",IF(IFERROR(DATEVALUE(TEXT(COMPARISON_LAST_RUN,\"mm/dd/yyy\")),0)<=0,1,IF(IF(ISBLANK(C10),0,C10)=IF(ISBLANK(G10),0,G10),2,0)))","v":1}]
{"$rows_left_out":5}
{"sheet":"Data Import Summary","index":11,"n_rows":56,"n_cols":15,"rows_kept":56,"cut":false,"hidden":true,"merged":[[3,0,3,10],[28,0,28,10],[18,0,18,10],[27,0,27,10],[24,0,24,10],[23,0,23,10],[22,0,22,10],[21,0,21,10],[26,0,26,10],[31,0,31,10],[29,0,29,10],[30,0,30,10],[37,0,37,10],[36,0,36,10],[35,0,35,10],[34,0,34,10],[32,0,32,10],[33,0,33,10]]}
[]
["IRIS Tab","Question","ID ","Financial Workbook Worksheet","Cell","Additional field name details","Type","Required ","Validation","Export?","Link to application workbook","DB Field Name / \nDynamic Framework Question ID","DB Field Type  ","Dynamic Framework TABLE.COLUMN_NAME","Additional Notes"]
["Basic Review","Sources = Uses",null,"Development Budget","E50",null,"Number","Y","If cell =0 then \"Yes\",  if not equal to zero then \"No\".","Yes",{"$f":"IF('Development Budget'!$E$50=0,1,0)","v":1}]
["DO NOT DELETE. REQUIRED FOR IRIS DATA IMPORT."]
["Sources of Funds","HOME",null,"Sources of Funds Summary","A11",null,"Drop-down ( Yes, No)","N, but one cell must say \"Yes\". ","If cell = \"Yes\" then check, if other value, then blank. ","Yes if cell = \"Yes\"",{"$f":"'Sources of Funds Summary'!$A$11","v":0}]
["Sources of Funds","CDBG",null,"Sources of Funds Summary","A12",null,"Drop-down ( Yes, No)","N, but one cell must say \"Yes\". ","If cell = \"Yes\" then check, if other value, then blank. ","Yes if cell = \"Yes\"",{"$f":"'Sources of Funds Summary'!$A$12","v":0}]
["Sources of Funds","FHA",null,"Sources of Funds Summary","A13",null,"Drop-down ( Yes, No)","N, but one cell must say \"Yes\". ","If cell = \"Yes\" then check, if other value, then blank. ","Yes if cell = \"Yes\"",{"$f":"'Sources of Funds Summary'!$A$13","v":0}]
["Sources of Funds","LIHTC",null,"Sources of Funds Summary","A14",null,"Drop-down ( Yes, No)","N, but one cell must say \"Yes\". ","If cell = \"Yes\" then check, if other value, then blank. ","Yes if cell = \"Yes\"",{"$f":"'Sources of Funds Summary'!$A$14","v":0}]
["Sources of Funds","Other Federal Housing",null,"Sources of Funds Summary","A15",null,"Drop-down ( Yes, No)","N, but one cell must say \"Yes\". ","If cell = \"Yes\" then check, if other value, then blank. ","Yes if cell = \"Yes\"",{"$f":"'Sources of Funds Summary'!$A$15","v":0}]
["Sources of Funds","Tax Exempt",null,"Sources of Funds Summary","A16",null,"Drop-down ( Yes, No)","N, but one cell must say \"Yes\". ","If cell = \"Yes\" then check, if other value, then blank. ","Yes if cell = \"Yes\"",{"$f":"'Sources of Funds Summary'!$A$16","v":0}]
{"$rows_left_out":47}
{"sheet":"Version Control","index":12,"n_rows":31,"n_cols":6,"rows_kept":31,"cut":false,"hidden":true,"merged":[]}
["AHP Application Financial Workbook Changes Log"]
[]
["Updated","2021-01-07"]
["By","Rose Wirtz"]
[]
[]
["Financial Workbook","Version","Tab","Description of Change from Previous Version","Completed by, date","Approver"]
[]
[]
["Owner-occupied ",5,"All tabs","New FHLBSF logo and version number (5.0)"]
{"$rows_left_out":21}